Console Output

Started by timer
Running as SYSTEM
Building remotely on build2-deb9build-ansible (ttcn3 osmo-gsm-tester-build osmocom-gerrit-debian9 osmocom-master-debian9 coverity) in workspace /home/osmocom-build/jenkins/workspace/Osmocom-build-tags-against-master
No credentials specified
Wiping out workspace first.
Cloning the remote Git repository
Cloning repository git://git.osmocom.org/osmo-ci
 > git init /home/osmocom-build/jenkins/workspace/Osmocom-build-tags-against-master # timeout=10
Fetching upstream changes from git://git.osmocom.org/osmo-ci
 > git --version # timeout=10
 > git fetch --tags --progress -- git://git.osmocom.org/osmo-ci +refs/heads/*:refs/remotes/origin/* # timeout=10
 > git config remote.origin.url git://git.osmocom.org/osmo-ci # timeout=10
 > git config --add remote.origin.fetch +refs/heads/*:refs/remotes/origin/* # timeout=10
 > git config remote.origin.url git://git.osmocom.org/osmo-ci # timeout=10
Fetching upstream changes from git://git.osmocom.org/osmo-ci
 > git fetch --tags --progress -- git://git.osmocom.org/osmo-ci +refs/heads/*:refs/remotes/origin/* # timeout=10
Seen branch in repository origin/lynxis/staging
Seen branch in repository origin/master
Seen branch in repository origin/neels/test
Seen branch in repository origin/neels/wip
Seen branch in repository origin/osmith/centos-install-test
Seen branch in repository origin/osmith/dependency-check
Seen branch in repository origin/osmith/fix-python3
Seen branch in repository origin/osmith/obs-fixes
Seen branch in repository origin/osmith/rpm
Seen branch in repository origin/osmith/ttcn3-centos
Seen branch in repository origin/osmith/ttcn3-latest
Seen branch in repository origin/pespin/limesuite-latest
Seen 12 remote branches
 > git show-ref --tags -d # timeout=10
Checking out Revision f95275f0ebe83a40a8b4bb6b653508d73d78d7a8 (origin/master)
 > git config core.sparsecheckout # timeout=10
 > git checkout -f f95275f0ebe83a40a8b4bb6b653508d73d78d7a8 # timeout=10
Commit message: "osmocom-latest-packages: Remove limesuite-debian10"
 > git rev-list --no-walk f95275f0ebe83a40a8b4bb6b653508d73d78d7a8 # timeout=10
[Osmocom-build-tags-against-master] $ /bin/sh -xe /tmp/jenkins7133699060213184462.sh
+ PARALLEL_MAKE=-j8 scripts/osmocom-build-old-tags-against-master.sh
Temp dir: /home/osmocom-build/jenkins/workspace/Osmocom-build-tags-against-master/_temp
Building libraries from current master...
 * libosmocore        8419bb2e9e7b24e21b9dd71352f4490e572ba4ee
 * libosmo-abis       8d150019102bd73295fe29beb8de137299d9a827
 * libosmo-netif      b1e01cbbbd38edf81ac7c36145b76a8c94fa9656
 * libosmo-sccp       9472ab91ba81132a5539f55ae214988698c0b332
 * libsmpp34          cecae664fffd356c6dbf275844e0e6739adf25e2
 * libasn1c           424132003433e8587d1919e94860ae3247a7df41
 * osmo-ggsn          d08a15b343bea53b096442da288af3d0102bfea6
 * osmo-iuh           4f18ce1ecc87c0db7e49c12817c8988c4ed95aef
 * osmo-hlr           80cb6c93b99095413305eb5c85acd4f936b5d750
 * osmo-mgw           113141d4f98fed6345bf509530db96da7d32e0e7
Building legacy libraries...
 * osmo-mgw                1.4.0 (provides libosmo-legacy-mgcp)
Building old tags against libraries from current master... (ERR: new error, err: known error)
 * libosmo-abis           0.7.0           0.8.0           0.8.1      
 * libosmocore            1.3.0           1.3.1           1.3.2      
 * libosmo-netif          0.5.0           0.6.0           0.7.0      
 * libosmo-sccp           1.1.0           1.2.0           1.2.1      
 * openbsc                1.3.0           1.3.1           1.3.2      
 * osmo-bsc               1.5.0           1.6.0           1.6.1      
 * osmo-bts               1.1.0           1.2.0           1.2.1      
 * osmo-ggsn              1.3.0           1.4.0           1.5.0      
 * osmo-hlr               1.0.0           1.1.0           1.2.0      
 * osmo-iuh               0.5.0           0.6.0           0.6.1      
 * osmo-mgw               1.5.0           1.6.0           1.7.0      
 * osmo-msc               1.6.0           1.6.1           1.6.2      
 * osmo-pcu               0.6.0           0.7.0           0.8.0      
 * osmo-sgsn              1.5.0 (ERR)     1.6.0 (ERR)     1.6.1 (ERR)
 * osmo-sip-connector     1.3.0           1.3.1           1.4.0      
 * osmo-trx               1.1.0           1.1.1           1.2.0      
---
BUILD FAILED: osmo-sgsn-1.5.0.txt
Showing last lines of build log below (full log in temp dir/jenkins artifacts):
---
     ^~
gtphub.c:2959:14: error: ‘const struct osmo_sockaddr’ has no member named ‘l’
  dst->l = src->l;
              ^~
gtphub.c: In function ‘osmo_sockaddr_cmp’:
gtphub.c:2952:1: warning: control reaches end of non-void function [-Wreturn-type]
 }
 ^
Makefile:611: recipe for target 'gtphub.o' failed
make[3]: *** [gtphub.o] Error 1
make[3]: *** Waiting for unfinished jobs....
make[3]: Leaving directory '/home/osmocom-build/jenkins/workspace/Osmocom-build-tags-against-master/_deps/osmo-sgsn/src/gprs'
Makefile:391: recipe for target 'check-recursive' failed
make[2]: *** [check-recursive] Error 1
make[2]: Leaving directory '/home/osmocom-build/jenkins/workspace/Osmocom-build-tags-against-master/_deps/osmo-sgsn/src'
Makefile:453: recipe for target 'check-recursive' failed
make[1]: *** [check-recursive] Error 1
make[1]: Leaving directory '/home/osmocom-build/jenkins/workspace/Osmocom-build-tags-against-master/_deps/osmo-sgsn'
Makefile:744: recipe for target 'check' failed
make: *** [check] Error 2
---
BUILD FAILED: osmo-sgsn-1.6.0.txt
Showing last lines of build log below (full log in temp dir/jenkins artifacts):
---
     ^~
gtphub.c:2959:14: error: ‘const struct osmo_sockaddr’ has no member named ‘l’
  dst->l = src->l;
              ^~
gtphub.c: In function ‘osmo_sockaddr_cmp’:
gtphub.c:2952:1: warning: control reaches end of non-void function [-Wreturn-type]
 }
 ^
Makefile:475: recipe for target 'gtphub.o' failed
make[3]: *** [gtphub.o] Error 1
make[3]: *** Waiting for unfinished jobs....
make[3]: Leaving directory '/home/osmocom-build/jenkins/workspace/Osmocom-build-tags-against-master/_deps/osmo-sgsn/src/gtphub'
Makefile:394: recipe for target 'check-recursive' failed
make[2]: *** [check-recursive] Error 1
make[2]: Leaving directory '/home/osmocom-build/jenkins/workspace/Osmocom-build-tags-against-master/_deps/osmo-sgsn/src'
Makefile:453: recipe for target 'check-recursive' failed
make[1]: *** [check-recursive] Error 1
make[1]: Leaving directory '/home/osmocom-build/jenkins/workspace/Osmocom-build-tags-against-master/_deps/osmo-sgsn'
Makefile:744: recipe for target 'check' failed
make: *** [check] Error 2
---
BUILD FAILED: osmo-sgsn-1.6.1.txt
Showing last lines of build log below (full log in temp dir/jenkins artifacts):
---
     ^~
gtphub.c:2959:14: error: ‘const struct osmo_sockaddr’ has no member named ‘l’
  dst->l = src->l;
              ^~
gtphub.c: In function ‘osmo_sockaddr_cmp’:
gtphub.c:2952:1: warning: control reaches end of non-void function [-Wreturn-type]
 }
 ^
Makefile:475: recipe for target 'gtphub.o' failed
make[3]: *** [gtphub.o] Error 1
make[3]: *** Waiting for unfinished jobs....
make[3]: Leaving directory '/home/osmocom-build/jenkins/workspace/Osmocom-build-tags-against-master/_deps/osmo-sgsn/src/gtphub'
Makefile:394: recipe for target 'check-recursive' failed
make[2]: *** [check-recursive] Error 1
make[2]: Leaving directory '/home/osmocom-build/jenkins/workspace/Osmocom-build-tags-against-master/_deps/osmo-sgsn/src'
Makefile:453: recipe for target 'check-recursive' failed
make[1]: *** [check-recursive] Error 1
make[1]: Leaving directory '/home/osmocom-build/jenkins/workspace/Osmocom-build-tags-against-master/_deps/osmo-sgsn'
Makefile:744: recipe for target 'check' failed
make: *** [check] Error 2
---
Build step 'Execute shell' marked build as failure
Archiving artifacts
Sending e-mails to: jenkins-notifications@lists.osmocom.org
Finished: FAILURE