FailedConsole Output

Started by user Oliver Smith
Building remotely on host2-deb9build-ansible (ttcn3 osmo-gsm-tester-build osmocom-gerrit-debian9 osmocom-master-debian9) in workspace /home/osmocom-build/jenkins/workspace/Osmocom-build-tags-against-master
Wiping out workspace first.
Cloning the remote Git repository
Cloning repository git://git.osmocom.org/osmo-ci
 > git init /home/osmocom-build/jenkins/workspace/Osmocom-build-tags-against-master # timeout=10
Fetching upstream changes from git://git.osmocom.org/osmo-ci
 > git --version # timeout=10
 > git fetch --tags --progress git://git.osmocom.org/osmo-ci +refs/heads/*:refs/remotes/origin/*
 > git config remote.origin.url git://git.osmocom.org/osmo-ci # timeout=10
 > git config --add remote.origin.fetch +refs/heads/*:refs/remotes/origin/* # timeout=10
 > git config remote.origin.url git://git.osmocom.org/osmo-ci # timeout=10
Fetching upstream changes from git://git.osmocom.org/osmo-ci
 > git fetch --tags --progress git://git.osmocom.org/osmo-ci +refs/heads/*:refs/remotes/origin/*
Seen branch in repository origin/lynxis/staging
Seen branch in repository origin/master
Seen branch in repository origin/neels/test
Seen branch in repository origin/neels/wip
Seen branch in repository origin/osmith/build-old-tags-against-master
Seen branch in repository origin/osmith/dependency-check
Seen branch in repository origin/osmith/list-commits
Seen branch in repository origin/osmith/ttcn3-latest
Seen branch in repository origin/pespin/limesuite-latest
Seen branch in repository origin/pespin/master
Seen 10 remote branches
 > git show-ref --tags -d # timeout=10
Checking out Revision 025d4c2f05e61af5cad04a2e51a15a23f4a5e51b (origin/osmith/build-old-tags-against-master)
 > git config core.sparsecheckout # timeout=10
 > git checkout -f 025d4c2f05e61af5cad04a2e51a15a23f4a5e51b
Commit message: "jobs: add osmocom-build-tags-against-master.yml"
 > git rev-list --no-walk 7188650db0d6bd977bc1f68424d8c9e010e1b453 # timeout=10
First time build. Skipping changelog.
[Osmocom-build-tags-against-master] $ /bin/sh -xe /tmp/jenkins1115045674982787814.sh
+ scripts/osmocom-build-old-tags-against-master.sh
Temp dir (with build logs): /home/osmocom-build/jenkins/workspace/Osmocom-build-tags-against-master/_temp
Building libraries from current master...
 * libosmocore        27f7b0da6f30bc8ff35d8b33bdf77aa3bdb38fd4
 * libosmo-abis       bab7ae7e884cd460f64d18ca703ae1ea238fa054
 * libosmo-netif      b3e34435b3bde227805c8dcac39c28e57144e500
 * libosmo-sccp       99beede80cc054ac84c80d90a3aa7330cd519076
 * libsmpp34          3cf5229fa0502e759d45e8397b2e7341ab418165
 * libasn1c           5e00d6fd805f71fc0f8cea5cb26cf1a023b6cbb0
 * osmo-ggsn          3fc9cc97de9f594b32def873ee78301a9ac608b4
 * osmo-iuh           f60152697008e78ce2a9c98bbcb176a4012cfd69
 * osmo-hlr           3cf87fe22cf53178ddd4f7e5c4be67ca8c4bc8bd
 * osmo-mgw           228e591589c0c3dfc5567c380a94f5bba90496dd
Building old tags against libraries from current master...
 * libosmo-abis           0.5.0     0.5.1     0.6.0
 * libosmocore           0.12.1     1.0.0     1.0.1
 * libosmo-netif          0.2.0     0.3.0     0.4.0
 * libosmo-sccp           0.9.0    0.10.0     1.0.0
 * openbsc                1.0.0
BUILD FAILED!
Showing last lines of build log below, full log (see jenkins artifacts):
/home/osmocom-build/jenkins/workspace/Osmocom-build-tags-against-master/_temp/log/openbsc-1.0.0.txt
---
   Subject: [openbsc 1.0.0] testsuite: 4 15 failed

You may investigate any problem if you feel able to do so, in which
case the test suite provides a good starting point.  Its output may
be found below `tests/testsuite.dir'.

Makefile:736: recipe for target 'check-local' failed
make[4]: *** [check-local] Error 1
make[4]: Leaving directory '/home/osmocom-build/jenkins/workspace/Osmocom-build-tags-against-master/_deps/openbsc/openbsc/tests'
Makefile:586: recipe for target 'check-am' failed
make[3]: *** [check-am] Error 2
make[3]: Leaving directory '/home/osmocom-build/jenkins/workspace/Osmocom-build-tags-against-master/_deps/openbsc/openbsc/tests'
Makefile:438: recipe for target 'check-recursive' failed
make[2]: *** [check-recursive] Error 1
make[2]: Leaving directory '/home/osmocom-build/jenkins/workspace/Osmocom-build-tags-against-master/_deps/openbsc/openbsc/tests'
Makefile:520: recipe for target 'check-recursive' failed
make[1]: *** [check-recursive] Error 1
make[1]: Leaving directory '/home/osmocom-build/jenkins/workspace/Osmocom-build-tags-against-master/_deps/openbsc/openbsc'
Makefile:811: recipe for target 'check' failed
make: *** [check] Error 2
Build step 'Execute shell' marked build as failure
Archiving artifacts
Finished: FAILURE