Skip to content

Failed

4g:srsenb-rftype@zmq+srsue-rftype@zmq.handover.py (from 4g_srsenb-rftype@zmq+srsue-rftype@zmq)

Failing for the past 220 builds (Since #2139 )
Took 20 sec.

Stacktrace

srsepc(pid=29632): Process ended prematurely: srsepc(pid=29632) [trial-2358↪4g:srsenb-rftype@zmq+srsue-rftype@zmq↪handover.py:37↪handover.py↪srsepc_10.42.42.118↪host-jenkins@10.42.42.116↪srsepc(pid=29632)]

Standard Output

----------------------------------------------
trial-2358 4g:srsenb-rftype@zmq+srsue-rftype@zmq handover.py
----------------------------------------------
11:05:39.298244 tst                   handover.py:11: TEST_CONFIG:
{}
11:05:39.340217 tst 4g:srsenb-rftype@zmq+srsue-rftype@zmq: Using 1 x run_node (candidates: 1)
11:05:39.356105 tst 4g:srsenb-rftype@zmq+srsue-rftype@zmq: Using 1 x enb (candidates: 1)
11:05:39.379104 tst 4g:srsenb-rftype@zmq+srsue-rftype@zmq: Using 1 x modem (candidates: 1)
11:05:39.523864 tst                      handover.py: using MSISDN 7180
11:05:39.632035 run              srsepc_10.42.42.118: Add subscriber {algo_str='mil', imsi='001010123456789', msisdn='7180', subscriber_id=0}
11:05:39.738901 run              srsepc_10.42.42.118: Starting srsepc
11:05:41.616462 run         rm-remote-dir(pid=29620): Launched
11:05:41.816109 bus                        /sierra_2: Setting Powered False
11:05:42.839299 run         rm-remote-dir(pid=29620): Terminated: ok {rc=0}
11:05:43.294235 run         mk-remote-dir(pid=29621): Launched
11:05:44.495919 run         mk-remote-dir(pid=29621): Terminated: ok {rc=0}
11:05:44.793916 run    scp-inst-to-remote(pid=29622): Launched
11:05:46.993883 run    scp-inst-to-remote(pid=29622): Terminated: ok {rc=0}
11:05:47.385281 run         rm-remote-dir(pid=29624): Launched
11:05:48.573935 run         rm-remote-dir(pid=29624): Terminated: ok {rc=0}
11:05:48.905096 run         mk-remote-dir(pid=29625): Launched
11:05:50.093307 run         mk-remote-dir(pid=29625): Terminated: ok {rc=0}
11:05:50.374436 run     scp-cfg-to-remote(pid=29626): Launched
11:05:51.560072 run     scp-cfg-to-remote(pid=29626): Terminated: ok {rc=0}
11:05:51.838986 run      scp-db-to-remote(pid=29628): Launched
11:05:53.025130 run      scp-db-to-remote(pid=29628): Terminated: ok {rc=0}
11:05:53.139756 run              srsepc_10.42.42.118: Setting RPATH for srsepc
11:05:53.461134 run              patchelf(pid=29630): Launched
11:05:54.647317 run              patchelf(pid=29630): Terminated: ok {rc=0}
11:05:54.761707 run              srsepc_10.42.42.118: Applying CAP_NET_ADMIN capability to srsepc
11:05:55.082971 run         setcap-netadm(pid=29631): Launched
11:05:56.269254 run         setcap-netadm(pid=29631): Terminated: ok {rc=0}
11:05:56.583544 run                srsepc(pid=29632): Launched
11:05:56.695004 run   srsenb_srsENB-zmq_10.42.42.117: Starting srsENB
11:05:57.827228 run         rm-remote-dir(pid=29633): Launched
11:05:58.014135 run                srsepc(pid=29632): ERR: Terminated: ERROR {rc=127}  [trial-2358↪4g:srsenb-rftype@zmq+srsue-rftype@zmq↪handover.py:37↪handover.py↪srsepc_10.42.42.118↪host-jenkins@10.42.42.116↪srsepc(pid=29632)]
11:05:58.150807 run                srsepc(pid=29632): stdout: 
| (launched: 2022-12-09_11:05:56.432051)
| /osmo-gsm-tester-srsepc/srslte/bin/srsepc: error while loading shared libraries: libboost_program_options.so.1.62.0: cannot open shared object file: No such file or directory 
11:05:58.286115 run                srsepc(pid=29632): stderr: 
| (launched: 2022-12-09_11:05:56.478084)
| Connection to 10.42.42.116 closed. 
11:05:58.416819 run                srsepc(pid=29632): stdout: 
| (launched: 2022-12-09_11:05:56.432051)
| /osmo-gsm-tester-srsepc/srslte/bin/srsepc: error while loading shared libraries: libboost_program_options.so.1.62.0: cannot open shared object file: No such file or directory 
11:05:58.546301 run                srsepc(pid=29632): stderr: 
| (launched: 2022-12-09_11:05:56.478084)
| Connection to 10.42.42.116 closed. 
11:05:58.697991 run         rm-remote-dir(pid=29633): Terminating (SIGINT)
11:05:58.876011 run         rm-remote-dir(pid=29633): Terminated: ok {rc=0}
11:05:58.909055 tst                   handover.py:37: ERR: Error: srsepc(pid=29632): Process ended prematurely: srsepc(pid=29632) [trial-2358↪4g:srsenb-rftype@zmq+srsue-rftype@zmq↪handover.py:37↪handover.py↪srsepc_10.42.42.118↪host-jenkins@10.42.42.116↪srsepc(pid=29632)]  [trial-2358↪4g:srsenb-rftype@zmq+srsue-rftype@zmq↪handover.py:37]
11:05:58.918907 tst                   handover.py:37: Test FAILED (19.8 sec)
11:05:59.031645 run          scp-back-log(pid=29634): Launched
11:06:00.119200 run          scp-back-log(pid=29634): ERR: Terminated: ERROR {rc=1}  [trial-2358↪4g:srsenb-rftype@zmq+srsue-rftype@zmq↪handover.py↪handover.py↪srsepc_10.42.42.118↪host-jenkins@10.42.42.116↪scp-back-log(pid=29634)]
11:06:00.181842 run          scp-back-log(pid=29634): stdout: 
| (launched: 2022-12-09_11:05:58.960528) 
11:06:00.245120 run          scp-back-log(pid=29634): stderr: 
| (launched: 2022-12-09_11:05:58.980407)
| scp: /osmo-gsm-tester-srsepc/srsepc/srsepc.log: No such file or directory 
11:06:00.298794 tst              srsepc_10.42.42.118: Error('scp-back-log(pid=29634): launch_sync(): local process exited with status 1 [trial-2358↪4g:srsenb-rftype@zmq+srsue-rftype@zmq↪handover.py↪handover.py↪srsepc_10.42.42.118↪host-jenkins@10.42.42.116↪scp-back-log(pid=29634)]')

Standard Error

Traceback (most recent call last):
  File "/home/jenkins/workspace/osmo-gsm-tester_run-prod/osmo-gsm-tester/src/osmo_gsm_tester/core/test.py", line 76, in run
    self.path)
  File "/home/jenkins/workspace/osmo-gsm-tester_run-prod/osmo-gsm-tester/src/osmo_gsm_tester/core/util.py", line 414, in run_python_file
    spec.loader.exec_module( importlib.util.module_from_spec(spec) )
  File "<frozen importlib._bootstrap_external>", line 728, in exec_module
  File "<frozen importlib._bootstrap>", line 219, in _call_with_frames_removed
  File "/home/jenkins/workspace/osmo-gsm-tester_run-prod/osmo-gsm-tester/sysmocom/suites/4g/handover.py", line 37, in <module>
    enb.start(epc)
  File "/home/jenkins/workspace/osmo-gsm-tester_run-prod/osmo-gsm-tester/src/osmo_gsm_tester/obj/enb_srs.py", line 237, in start
    self.configure()
  File "/home/jenkins/workspace/osmo-gsm-tester_run-prod/osmo-gsm-tester/src/osmo_gsm_tester/obj/enb_srs.py", line 423, in configure
    self.rem_host.recreate_remote_dir(self.remote_inst)
  File "/home/jenkins/workspace/osmo-gsm-tester_run-prod/osmo-gsm-tester/src/osmo_gsm_tester/core/remote.py", line 146, in recreate_remote_dir
    self.rm_remote_dir(remote_dir)
  File "/home/jenkins/workspace/osmo-gsm-tester_run-prod/osmo-gsm-tester/src/osmo_gsm_tester/core/remote.py", line 139, in rm_remote_dir
    self.run_remote_sync('rm-remote-dir', ('test', '!', '-d', remote_dir_str, '||', 'rm', '-rf', remote_dir_str))
  File "/home/jenkins/workspace/osmo-gsm-tester_run-prod/osmo-gsm-tester/src/osmo_gsm_tester/core/remote.py", line 134, in run_remote_sync
    proc.launch_sync()
  File "/home/jenkins/workspace/osmo-gsm-tester_run-prod/osmo-gsm-tester/src/osmo_gsm_tester/core/process.py", line 214, in launch_sync
    raise e
  File "/home/jenkins/workspace/osmo-gsm-tester_run-prod/osmo-gsm-tester/src/osmo_gsm_tester/core/process.py", line 211, in launch_sync
    self.wait()
  File "/home/jenkins/workspace/osmo-gsm-tester_run-prod/osmo-gsm-tester/src/osmo_gsm_tester/core/process.py", line 421, in wait
    MainLoop.wait(self.terminated, timeout=timeout)
  File "/home/jenkins/workspace/osmo-gsm-tester_run-prod/osmo-gsm-tester/src/osmo_gsm_tester/core/event_loop.py", line 108, in wait
    if not self.wait_no_raise(condition, condition_args, condition_kwargs, timeout, timestep):
  File "/home/jenkins/workspace/osmo-gsm-tester_run-prod/osmo-gsm-tester/src/osmo_gsm_tester/core/event_loop.py", line 98, in wait_no_raise
    self.poll(may_block=True)
  File "/home/jenkins/workspace/osmo-gsm-tester_run-prod/osmo-gsm-tester/src/osmo_gsm_tester/core/event_loop.py", line 86, in poll
    self.deferred_handling.handle_queue()
  File "/home/jenkins/workspace/osmo-gsm-tester_run-prod/osmo-gsm-tester/src/osmo_gsm_tester/core/event_loop.py", line 33, in handle_queue
    handler(*args, **kwargs)
  File "/home/jenkins/workspace/osmo-gsm-tester_run-prod/osmo-gsm-tester/src/osmo_gsm_tester/testenv.py", line 142, in poll
    raise log_module.Error('Process ended prematurely: %s' % proc.name())
osmo_gsm_tester.core.log.Error: srsepc(pid=29632): Process ended prematurely: srsepc(pid=29632) [trial-2358↪4g:srsenb-rftype@zmq+srsue-rftype@zmq↪handover.py:37↪handover.py↪srsepc_10.42.42.118↪host-jenkins@10.42.42.116↪srsepc(pid=29632)]