Skip to content

Failed

4g:srsenb-rftype@zmq+srsue-rftype@zmq.handover.py (from 4g_srsenb-rftype@zmq+srsue-rftype@zmq)

Failing for the past 212 builds (Since #2139 )
Took 21 sec.

Stacktrace

srsepc(pid=25137): Process ended prematurely: srsepc(pid=25137) [trial-2350↪4g:srsenb-rftype@zmq+srsue-rftype@zmq↪handover.py:37↪handover.py↪srsepc_10.42.42.118↪host-jenkins@10.42.42.116↪srsepc(pid=25137)]

Standard Output

----------------------------------------------
trial-2350 4g:srsenb-rftype@zmq+srsue-rftype@zmq handover.py
----------------------------------------------
22:59:31.939529 tst                   handover.py:11: TEST_CONFIG:
{}
22:59:31.984181 tst 4g:srsenb-rftype@zmq+srsue-rftype@zmq: Using 1 x run_node (candidates: 1)
22:59:32.000767 tst 4g:srsenb-rftype@zmq+srsue-rftype@zmq: Using 1 x enb (candidates: 1)
22:59:32.025533 tst 4g:srsenb-rftype@zmq+srsue-rftype@zmq: Using 1 x modem (candidates: 1)
22:59:32.194775 tst                      handover.py: using MSISDN 6900
22:59:32.307029 run              srsepc_10.42.42.118: Add subscriber {algo_str='mil', imsi='001010123456789', msisdn='6900', subscriber_id=0}
22:59:32.414632 run              srsepc_10.42.42.118: Starting srsepc
22:59:34.269581 run         rm-remote-dir(pid=25125): Launched
22:59:34.455280 bus                        /sierra_2: Setting Powered False
22:59:35.480577 run         rm-remote-dir(pid=25125): Terminated: ok {rc=0}
22:59:35.933436 run         mk-remote-dir(pid=25126): Launched
22:59:37.135086 run         mk-remote-dir(pid=25126): Terminated: ok {rc=0}
22:59:37.439989 run    scp-inst-to-remote(pid=25127): Launched
22:59:39.640228 run    scp-inst-to-remote(pid=25127): Terminated: ok {rc=0}
22:59:39.991249 run         rm-remote-dir(pid=25129): Launched
22:59:41.192801 run         rm-remote-dir(pid=25129): Terminated: ok {rc=0}
22:59:41.543985 run         mk-remote-dir(pid=25130): Launched
22:59:42.746352 run         mk-remote-dir(pid=25130): Terminated: ok {rc=0}
22:59:43.043212 run     scp-cfg-to-remote(pid=25131): Launched
22:59:44.242444 run     scp-cfg-to-remote(pid=25131): Terminated: ok {rc=0}
22:59:44.539073 run      scp-db-to-remote(pid=25133): Launched
22:59:45.738828 run      scp-db-to-remote(pid=25133): Terminated: ok {rc=0}
22:59:45.863654 run              srsepc_10.42.42.118: Setting RPATH for srsepc
22:59:46.254853 run              patchelf(pid=25135): Launched
22:59:47.459934 run              patchelf(pid=25135): Terminated: ok {rc=0}
22:59:47.582781 run              srsepc_10.42.42.118: Applying CAP_NET_ADMIN capability to srsepc
22:59:47.925593 run         setcap-netadm(pid=25136): Launched
22:59:49.125248 run         setcap-netadm(pid=25136): Terminated: ok {rc=0}
22:59:49.458983 run                srsepc(pid=25137): Launched
22:59:49.579350 run   srsenb_srsENB-zmq_10.42.42.117: Starting srsENB
22:59:50.775342 run         rm-remote-dir(pid=25138): Launched
22:59:50.974228 run                srsepc(pid=25137): ERR: Terminated: ERROR {rc=127}  [trial-2350↪4g:srsenb-rftype@zmq+srsue-rftype@zmq↪handover.py:37↪handover.py↪srsepc_10.42.42.118↪host-jenkins@10.42.42.116↪srsepc(pid=25137)]
22:59:51.119971 run                srsepc(pid=25137): stdout: 
| (launched: 2022-12-08_22:59:49.300319)
| /osmo-gsm-tester-srsepc/srslte/bin/srsepc: error while loading shared libraries: libboost_program_options.so.1.62.0: cannot open shared object file: No such file or directory 
22:59:51.265596 run                srsepc(pid=25137): stderr: 
| (launched: 2022-12-08_22:59:49.349929)
| Connection to 10.42.42.116 closed. 
22:59:51.406783 run                srsepc(pid=25137): stdout: 
| (launched: 2022-12-08_22:59:49.300319)
| /osmo-gsm-tester-srsepc/srslte/bin/srsepc: error while loading shared libraries: libboost_program_options.so.1.62.0: cannot open shared object file: No such file or directory 
22:59:51.547004 run                srsepc(pid=25137): stderr: 
| (launched: 2022-12-08_22:59:49.349929)
| Connection to 10.42.42.116 closed. 
22:59:51.710394 run         rm-remote-dir(pid=25138): Terminating (SIGINT)
22:59:51.901337 run         rm-remote-dir(pid=25138): Terminated: ok {rc=0}
22:59:51.936273 tst                   handover.py:37: ERR: Error: srsepc(pid=25137): Process ended prematurely: srsepc(pid=25137) [trial-2350↪4g:srsenb-rftype@zmq+srsue-rftype@zmq↪handover.py:37↪handover.py↪srsepc_10.42.42.118↪host-jenkins@10.42.42.116↪srsepc(pid=25137)]  [trial-2350↪4g:srsenb-rftype@zmq+srsue-rftype@zmq↪handover.py:37]
22:59:51.946480 tst                   handover.py:37: Test FAILED (20.2 sec)
22:59:52.063146 run          scp-back-log(pid=25139): Launched
22:59:53.155432 run          scp-back-log(pid=25139): ERR: Terminated: ERROR {rc=1}  [trial-2350↪4g:srsenb-rftype@zmq+srsue-rftype@zmq↪handover.py↪handover.py↪srsepc_10.42.42.118↪host-jenkins@10.42.42.116↪scp-back-log(pid=25139)]
22:59:53.221940 run          scp-back-log(pid=25139): stdout: 
| (launched: 2022-12-08_22:59:51.990772) 
22:59:53.288723 run          scp-back-log(pid=25139): stderr: 
| (launched: 2022-12-08_22:59:52.011728)
| scp: /osmo-gsm-tester-srsepc/srsepc/srsepc.log: No such file or directory 
22:59:53.344927 tst              srsepc_10.42.42.118: Error('scp-back-log(pid=25139): launch_sync(): local process exited with status 1 [trial-2350↪4g:srsenb-rftype@zmq+srsue-rftype@zmq↪handover.py↪handover.py↪srsepc_10.42.42.118↪host-jenkins@10.42.42.116↪scp-back-log(pid=25139)]')

Standard Error

Traceback (most recent call last):
  File "/home/jenkins/workspace/osmo-gsm-tester_run-prod/osmo-gsm-tester/src/osmo_gsm_tester/core/test.py", line 76, in run
    self.path)
  File "/home/jenkins/workspace/osmo-gsm-tester_run-prod/osmo-gsm-tester/src/osmo_gsm_tester/core/util.py", line 414, in run_python_file
    spec.loader.exec_module( importlib.util.module_from_spec(spec) )
  File "<frozen importlib._bootstrap_external>", line 728, in exec_module
  File "<frozen importlib._bootstrap>", line 219, in _call_with_frames_removed
  File "/home/jenkins/workspace/osmo-gsm-tester_run-prod/osmo-gsm-tester/sysmocom/suites/4g/handover.py", line 37, in <module>
    enb.start(epc)
  File "/home/jenkins/workspace/osmo-gsm-tester_run-prod/osmo-gsm-tester/src/osmo_gsm_tester/obj/enb_srs.py", line 237, in start
    self.configure()
  File "/home/jenkins/workspace/osmo-gsm-tester_run-prod/osmo-gsm-tester/src/osmo_gsm_tester/obj/enb_srs.py", line 423, in configure
    self.rem_host.recreate_remote_dir(self.remote_inst)
  File "/home/jenkins/workspace/osmo-gsm-tester_run-prod/osmo-gsm-tester/src/osmo_gsm_tester/core/remote.py", line 146, in recreate_remote_dir
    self.rm_remote_dir(remote_dir)
  File "/home/jenkins/workspace/osmo-gsm-tester_run-prod/osmo-gsm-tester/src/osmo_gsm_tester/core/remote.py", line 139, in rm_remote_dir
    self.run_remote_sync('rm-remote-dir', ('test', '!', '-d', remote_dir_str, '||', 'rm', '-rf', remote_dir_str))
  File "/home/jenkins/workspace/osmo-gsm-tester_run-prod/osmo-gsm-tester/src/osmo_gsm_tester/core/remote.py", line 134, in run_remote_sync
    proc.launch_sync()
  File "/home/jenkins/workspace/osmo-gsm-tester_run-prod/osmo-gsm-tester/src/osmo_gsm_tester/core/process.py", line 214, in launch_sync
    raise e
  File "/home/jenkins/workspace/osmo-gsm-tester_run-prod/osmo-gsm-tester/src/osmo_gsm_tester/core/process.py", line 211, in launch_sync
    self.wait()
  File "/home/jenkins/workspace/osmo-gsm-tester_run-prod/osmo-gsm-tester/src/osmo_gsm_tester/core/process.py", line 421, in wait
    MainLoop.wait(self.terminated, timeout=timeout)
  File "/home/jenkins/workspace/osmo-gsm-tester_run-prod/osmo-gsm-tester/src/osmo_gsm_tester/core/event_loop.py", line 108, in wait
    if not self.wait_no_raise(condition, condition_args, condition_kwargs, timeout, timestep):
  File "/home/jenkins/workspace/osmo-gsm-tester_run-prod/osmo-gsm-tester/src/osmo_gsm_tester/core/event_loop.py", line 98, in wait_no_raise
    self.poll(may_block=True)
  File "/home/jenkins/workspace/osmo-gsm-tester_run-prod/osmo-gsm-tester/src/osmo_gsm_tester/core/event_loop.py", line 86, in poll
    self.deferred_handling.handle_queue()
  File "/home/jenkins/workspace/osmo-gsm-tester_run-prod/osmo-gsm-tester/src/osmo_gsm_tester/core/event_loop.py", line 33, in handle_queue
    handler(*args, **kwargs)
  File "/home/jenkins/workspace/osmo-gsm-tester_run-prod/osmo-gsm-tester/src/osmo_gsm_tester/testenv.py", line 142, in poll
    raise log_module.Error('Process ended prematurely: %s' % proc.name())
osmo_gsm_tester.core.log.Error: srsepc(pid=25137): Process ended prematurely: srsepc(pid=25137) [trial-2350↪4g:srsenb-rftype@zmq+srsue-rftype@zmq↪handover.py:37↪handover.py↪srsepc_10.42.42.118↪host-jenkins@10.42.42.116↪srsepc(pid=25137)]