Skip to content

Failed

4g:srsenb-rftype@zmq+srsue-rftype@zmq.iperf3_ul.py (from 4g_srsenb-rftype@zmq+srsue-rftype@zmq)

Failing for the past 213 builds (Since #2139 )
Took 19 sec.

Stacktrace

srsepc(pid=1371): Process ended prematurely: srsepc(pid=1371) [trial-2351↪4g:srsenb-rftype@zmq+srsue-rftype@zmq↪iperf3_ul.py:42↪iperf3_ul.py↪srsepc_10.42.42.118↪host-jenkins@10.42.42.116↪srsepc(pid=1371)]

Standard Output

----------------------------------------------
trial-2351 4g:srsenb-rftype@zmq+srsue-rftype@zmq iperf3_ul.py
----------------------------------------------
00:27:46.647122 tst                  iperf3_ul.py:13: Number of physical ue: 1
00:27:46.689933 tst 4g:srsenb-rftype@zmq+srsue-rftype@zmq: Using 1 x modem (candidates: 1)
00:27:46.914936 tst                  iperf3_ul.py:20: ue index0: srsue_10.42.42.116
00:27:46.961452 tst 4g:srsenb-rftype@zmq+srsue-rftype@zmq: Using 1 x run_node (candidates: 1)
00:27:46.978921 tst 4g:srsenb-rftype@zmq+srsue-rftype@zmq: Using 1 x enb (candidates: 1)
00:27:47.111328 tst                     iperf3_ul.py: using MSISDN 6938
00:27:47.229222 run              srsepc_10.42.42.118: Add subscriber {algo_str='mil', imsi='001010123456789', msisdn='6938', subscriber_id=0}
00:27:47.343551 run              srsepc_10.42.42.118: Starting srsepc
00:27:48.025324 run          rm-remote-dir(pid=1359): Launched
00:27:49.224661 run          rm-remote-dir(pid=1359): Terminated: ok {rc=0}
00:27:49.572513 run          mk-remote-dir(pid=1360): Launched
00:27:50.771839 run          mk-remote-dir(pid=1360): Terminated: ok {rc=0}
00:27:51.067480 run     scp-inst-to-remote(pid=1361): Launched
00:27:53.265480 run     scp-inst-to-remote(pid=1361): Terminated: ok {rc=0}
00:27:53.613634 run          rm-remote-dir(pid=1363): Launched
00:27:54.812903 run          rm-remote-dir(pid=1363): Terminated: ok {rc=0}
00:27:55.161673 run          mk-remote-dir(pid=1364): Launched
00:27:56.360343 run          mk-remote-dir(pid=1364): Terminated: ok {rc=0}
00:27:56.655228 run      scp-cfg-to-remote(pid=1365): Launched
00:27:57.842787 run      scp-cfg-to-remote(pid=1365): Terminated: ok {rc=0}
00:27:58.121730 run       scp-db-to-remote(pid=1367): Launched
00:27:59.309168 run       scp-db-to-remote(pid=1367): Terminated: ok {rc=0}
00:27:59.423316 run              srsepc_10.42.42.118: Setting RPATH for srsepc
00:27:59.743950 run               patchelf(pid=1369): Launched
00:28:00.958330 run               patchelf(pid=1369): Terminated: ok {rc=0}
00:28:01.083253 run              srsepc_10.42.42.118: Applying CAP_NET_ADMIN capability to srsepc
00:28:01.485390 run          setcap-netadm(pid=1370): Launched
00:28:02.683887 run          setcap-netadm(pid=1370): Terminated: ok {rc=0}
00:28:03.014491 run                 srsepc(pid=1371): Launched
00:28:03.130580 run   srsenb_srsENB-zmq_10.42.42.117: Starting srsENB
00:28:04.322650 run          rm-remote-dir(pid=1372): Launched
00:28:04.520280 run                 srsepc(pid=1371): ERR: Terminated: ERROR {rc=127}  [trial-2351↪4g:srsenb-rftype@zmq+srsue-rftype@zmq↪iperf3_ul.py:42↪iperf3_ul.py↪srsepc_10.42.42.118↪host-jenkins@10.42.42.116↪srsepc(pid=1371)]
00:28:04.664205 run                 srsepc(pid=1371): stdout: 
| (launched: 2022-12-09_00:28:02.857662)
| /osmo-gsm-tester-srsepc/srslte/bin/srsepc: error while loading shared libraries: libboost_program_options.so.1.62.0: cannot open shared object file: No such file or directory 
00:28:04.808596 run                 srsepc(pid=1371): stderr: 
| (launched: 2022-12-09_00:28:02.906361)
| Connection to 10.42.42.116 closed. 
00:28:04.948626 run                 srsepc(pid=1371): stdout: 
| (launched: 2022-12-09_00:28:02.857662)
| /osmo-gsm-tester-srsepc/srslte/bin/srsepc: error while loading shared libraries: libboost_program_options.so.1.62.0: cannot open shared object file: No such file or directory 
00:28:05.086988 run                 srsepc(pid=1371): stderr: 
| (launched: 2022-12-09_00:28:02.906361)
| Connection to 10.42.42.116 closed. 
00:28:05.248650 run          rm-remote-dir(pid=1372): Terminating (SIGINT)
00:28:05.437905 run          rm-remote-dir(pid=1372): Terminated: ok {rc=0}
00:28:05.472629 tst                  iperf3_ul.py:42: ERR: Error: srsepc(pid=1371): Process ended prematurely: srsepc(pid=1371) [trial-2351↪4g:srsenb-rftype@zmq+srsue-rftype@zmq↪iperf3_ul.py:42↪iperf3_ul.py↪srsepc_10.42.42.118↪host-jenkins@10.42.42.116↪srsepc(pid=1371)]  [trial-2351↪4g:srsenb-rftype@zmq+srsue-rftype@zmq↪iperf3_ul.py:42]
00:28:05.483409 tst                  iperf3_ul.py:42: Test FAILED (19.0 sec)
00:28:05.596298 run           scp-back-log(pid=1373): Launched
00:28:06.685610 run           scp-back-log(pid=1373): ERR: Terminated: ERROR {rc=1}  [trial-2351↪4g:srsenb-rftype@zmq+srsue-rftype@zmq↪iperf3_ul.py↪iperf3_ul.py↪srsepc_10.42.42.118↪host-jenkins@10.42.42.116↪scp-back-log(pid=1373)]
00:28:06.749970 run           scp-back-log(pid=1373): stdout: 
| (launched: 2022-12-09_00:28:05.526060) 
00:28:06.814970 run           scp-back-log(pid=1373): stderr: 
| (launched: 2022-12-09_00:28:05.546346)
| scp: /osmo-gsm-tester-srsepc/srsepc/srsepc.log: No such file or directory 
00:28:06.869507 tst              srsepc_10.42.42.118: Error('scp-back-log(pid=1373): launch_sync(): local process exited with status 1 [trial-2351↪4g:srsenb-rftype@zmq+srsue-rftype@zmq↪iperf3_ul.py↪iperf3_ul.py↪srsepc_10.42.42.118↪host-jenkins@10.42.42.116↪scp-back-log(pid=1373)]')

Standard Error

Traceback (most recent call last):
  File "/home/jenkins/workspace/osmo-gsm-tester_run-prod/osmo-gsm-tester/src/osmo_gsm_tester/core/test.py", line 76, in run
    self.path)
  File "/home/jenkins/workspace/osmo-gsm-tester_run-prod/osmo-gsm-tester/src/osmo_gsm_tester/core/util.py", line 414, in run_python_file
    spec.loader.exec_module( importlib.util.module_from_spec(spec) )
  File "<frozen importlib._bootstrap_external>", line 728, in exec_module
  File "<frozen importlib._bootstrap>", line 219, in _call_with_frames_removed
  File "/home/jenkins/workspace/osmo-gsm-tester_run-prod/osmo-gsm-tester/sysmocom/suites/4g/iperf3_ul.py", line 42, in <module>
    enb.start(epc)
  File "/home/jenkins/workspace/osmo-gsm-tester_run-prod/osmo-gsm-tester/src/osmo_gsm_tester/obj/enb_srs.py", line 237, in start
    self.configure()
  File "/home/jenkins/workspace/osmo-gsm-tester_run-prod/osmo-gsm-tester/src/osmo_gsm_tester/obj/enb_srs.py", line 423, in configure
    self.rem_host.recreate_remote_dir(self.remote_inst)
  File "/home/jenkins/workspace/osmo-gsm-tester_run-prod/osmo-gsm-tester/src/osmo_gsm_tester/core/remote.py", line 146, in recreate_remote_dir
    self.rm_remote_dir(remote_dir)
  File "/home/jenkins/workspace/osmo-gsm-tester_run-prod/osmo-gsm-tester/src/osmo_gsm_tester/core/remote.py", line 139, in rm_remote_dir
    self.run_remote_sync('rm-remote-dir', ('test', '!', '-d', remote_dir_str, '||', 'rm', '-rf', remote_dir_str))
  File "/home/jenkins/workspace/osmo-gsm-tester_run-prod/osmo-gsm-tester/src/osmo_gsm_tester/core/remote.py", line 134, in run_remote_sync
    proc.launch_sync()
  File "/home/jenkins/workspace/osmo-gsm-tester_run-prod/osmo-gsm-tester/src/osmo_gsm_tester/core/process.py", line 214, in launch_sync
    raise e
  File "/home/jenkins/workspace/osmo-gsm-tester_run-prod/osmo-gsm-tester/src/osmo_gsm_tester/core/process.py", line 211, in launch_sync
    self.wait()
  File "/home/jenkins/workspace/osmo-gsm-tester_run-prod/osmo-gsm-tester/src/osmo_gsm_tester/core/process.py", line 421, in wait
    MainLoop.wait(self.terminated, timeout=timeout)
  File "/home/jenkins/workspace/osmo-gsm-tester_run-prod/osmo-gsm-tester/src/osmo_gsm_tester/core/event_loop.py", line 108, in wait
    if not self.wait_no_raise(condition, condition_args, condition_kwargs, timeout, timestep):
  File "/home/jenkins/workspace/osmo-gsm-tester_run-prod/osmo-gsm-tester/src/osmo_gsm_tester/core/event_loop.py", line 98, in wait_no_raise
    self.poll(may_block=True)
  File "/home/jenkins/workspace/osmo-gsm-tester_run-prod/osmo-gsm-tester/src/osmo_gsm_tester/core/event_loop.py", line 86, in poll
    self.deferred_handling.handle_queue()
  File "/home/jenkins/workspace/osmo-gsm-tester_run-prod/osmo-gsm-tester/src/osmo_gsm_tester/core/event_loop.py", line 33, in handle_queue
    handler(*args, **kwargs)
  File "/home/jenkins/workspace/osmo-gsm-tester_run-prod/osmo-gsm-tester/src/osmo_gsm_tester/testenv.py", line 142, in poll
    raise log_module.Error('Process ended prematurely: %s' % proc.name())
osmo_gsm_tester.core.log.Error: srsepc(pid=1371): Process ended prematurely: srsepc(pid=1371) [trial-2351↪4g:srsenb-rftype@zmq+srsue-rftype@zmq↪iperf3_ul.py:42↪iperf3_ul.py↪srsepc_10.42.42.118↪host-jenkins@10.42.42.116↪srsepc(pid=1371)]