Skip to content

Failed

4g:srsenb-rftype@zmq+srsue-rftype@zmq.handover.py (from 4g_srsenb-rftype@zmq+srsue-rftype@zmq)

Failing for the past 230 builds (Since #2139 )
Took 20 sec.

Stacktrace

srsepc(pid=19588): Process ended prematurely: srsepc(pid=19588) [trial-2368↪4g:srsenb-rftype@zmq+srsue-rftype@zmq↪handover.py:37↪handover.py↪srsepc_10.42.42.118↪host-jenkins@10.42.42.116↪srsepc(pid=19588)]

Standard Output

----------------------------------------------
trial-2368 4g:srsenb-rftype@zmq+srsue-rftype@zmq handover.py
----------------------------------------------
03:22:22.636302 tst                   handover.py:11: TEST_CONFIG:
{}
03:22:22.681245 tst 4g:srsenb-rftype@zmq+srsue-rftype@zmq: Using 1 x run_node (candidates: 1)
03:22:22.697725 tst 4g:srsenb-rftype@zmq+srsue-rftype@zmq: Using 1 x enb (candidates: 1)
03:22:22.721688 tst 4g:srsenb-rftype@zmq+srsue-rftype@zmq: Using 1 x modem (candidates: 1)
03:22:22.871036 tst                      handover.py: using MSISDN 7530
03:22:22.986156 run              srsepc_10.42.42.118: Add subscriber {algo_str='mil', imsi='001010123456789', msisdn='7530', subscriber_id=0}
03:22:23.100135 run              srsepc_10.42.42.118: Starting srsepc
03:22:25.031291 run         rm-remote-dir(pid=19576): Launched
03:22:25.229443 bus                        /sierra_2: Setting Powered False
03:22:26.252133 run         rm-remote-dir(pid=19576): Terminated: ok {rc=0}
03:22:26.702182 run         mk-remote-dir(pid=19577): Launched
03:22:27.902061 run         mk-remote-dir(pid=19577): Terminated: ok {rc=0}
03:22:28.197169 run    scp-inst-to-remote(pid=19578): Launched
03:22:30.396343 run    scp-inst-to-remote(pid=19578): Terminated: ok {rc=0}
03:22:30.745984 run         rm-remote-dir(pid=19580): Launched
03:22:31.940154 run         rm-remote-dir(pid=19580): Terminated: ok {rc=0}
03:22:32.303616 run         mk-remote-dir(pid=19581): Launched
03:22:33.504035 run         mk-remote-dir(pid=19581): Terminated: ok {rc=0}
03:22:33.799318 run     scp-cfg-to-remote(pid=19582): Launched
03:22:34.995850 run     scp-cfg-to-remote(pid=19582): Terminated: ok {rc=0}
03:22:35.291211 run      scp-db-to-remote(pid=19584): Launched
03:22:36.487922 run      scp-db-to-remote(pid=19584): Terminated: ok {rc=0}
03:22:36.609089 run              srsepc_10.42.42.118: Setting RPATH for srsepc
03:22:36.948389 run              patchelf(pid=19586): Launched
03:22:38.134664 run              patchelf(pid=19586): Terminated: ok {rc=0}
03:22:38.247436 run              srsepc_10.42.42.118: Applying CAP_NET_ADMIN capability to srsepc
03:22:38.569532 run         setcap-netadm(pid=19587): Launched
03:22:39.754203 run         setcap-netadm(pid=19587): Terminated: ok {rc=0}
03:22:40.063098 run                srsepc(pid=19588): Launched
03:22:40.172286 run   srsenb_srsENB-zmq_10.42.42.117: Starting srsENB
03:22:41.288069 run         rm-remote-dir(pid=19589): Launched
03:22:41.474320 run                srsepc(pid=19588): ERR: Terminated: ERROR {rc=127}  [trial-2368↪4g:srsenb-rftype@zmq+srsue-rftype@zmq↪handover.py:37↪handover.py↪srsepc_10.42.42.118↪host-jenkins@10.42.42.116↪srsepc(pid=19588)]
03:22:41.609766 run                srsepc(pid=19588): stdout: 
| (launched: 2022-12-10_03:22:39.915418)
| /osmo-gsm-tester-srsepc/srslte/bin/srsepc: error while loading shared libraries: libboost_program_options.so.1.62.0: cannot open shared object file: No such file or directory 
03:22:41.744662 run                srsepc(pid=19588): stderr: 
| (launched: 2022-12-10_03:22:39.961183)
| Connection to 10.42.42.116 closed. 
03:22:41.875720 run                srsepc(pid=19588): stdout: 
| (launched: 2022-12-10_03:22:39.915418)
| /osmo-gsm-tester-srsepc/srslte/bin/srsepc: error while loading shared libraries: libboost_program_options.so.1.62.0: cannot open shared object file: No such file or directory 
03:22:42.005473 run                srsepc(pid=19588): stderr: 
| (launched: 2022-12-10_03:22:39.961183)
| Connection to 10.42.42.116 closed. 
03:22:42.156515 run         rm-remote-dir(pid=19589): Terminating (SIGINT)
03:22:42.333952 run         rm-remote-dir(pid=19589): Terminated: ok {rc=0}
03:22:42.366989 tst                   handover.py:37: ERR: Error: srsepc(pid=19588): Process ended prematurely: srsepc(pid=19588) [trial-2368↪4g:srsenb-rftype@zmq+srsue-rftype@zmq↪handover.py:37↪handover.py↪srsepc_10.42.42.118↪host-jenkins@10.42.42.116↪srsepc(pid=19588)]  [trial-2368↪4g:srsenb-rftype@zmq+srsue-rftype@zmq↪handover.py:37]
03:22:42.376540 tst                   handover.py:37: Test FAILED (19.9 sec)
03:22:42.487845 run          scp-back-log(pid=19590): Launched
03:22:43.574654 run          scp-back-log(pid=19590): ERR: Terminated: ERROR {rc=1}  [trial-2368↪4g:srsenb-rftype@zmq+srsue-rftype@zmq↪handover.py↪handover.py↪srsepc_10.42.42.118↪host-jenkins@10.42.42.116↪scp-back-log(pid=19590)]
03:22:43.637496 run          scp-back-log(pid=19590): stdout: 
| (launched: 2022-12-10_03:22:42.418523) 
03:22:43.700700 run          scp-back-log(pid=19590): stderr: 
| (launched: 2022-12-10_03:22:42.438361)
| scp: /osmo-gsm-tester-srsepc/srsepc/srsepc.log: No such file or directory 
03:22:43.753560 tst              srsepc_10.42.42.118: Error('scp-back-log(pid=19590): launch_sync(): local process exited with status 1 [trial-2368↪4g:srsenb-rftype@zmq+srsue-rftype@zmq↪handover.py↪handover.py↪srsepc_10.42.42.118↪host-jenkins@10.42.42.116↪scp-back-log(pid=19590)]')

Standard Error

Traceback (most recent call last):
  File "/home/jenkins/workspace/osmo-gsm-tester_run-prod/osmo-gsm-tester/src/osmo_gsm_tester/core/test.py", line 76, in run
    self.path)
  File "/home/jenkins/workspace/osmo-gsm-tester_run-prod/osmo-gsm-tester/src/osmo_gsm_tester/core/util.py", line 414, in run_python_file
    spec.loader.exec_module( importlib.util.module_from_spec(spec) )
  File "<frozen importlib._bootstrap_external>", line 728, in exec_module
  File "<frozen importlib._bootstrap>", line 219, in _call_with_frames_removed
  File "/home/jenkins/workspace/osmo-gsm-tester_run-prod/osmo-gsm-tester/sysmocom/suites/4g/handover.py", line 37, in <module>
    enb.start(epc)
  File "/home/jenkins/workspace/osmo-gsm-tester_run-prod/osmo-gsm-tester/src/osmo_gsm_tester/obj/enb_srs.py", line 237, in start
    self.configure()
  File "/home/jenkins/workspace/osmo-gsm-tester_run-prod/osmo-gsm-tester/src/osmo_gsm_tester/obj/enb_srs.py", line 423, in configure
    self.rem_host.recreate_remote_dir(self.remote_inst)
  File "/home/jenkins/workspace/osmo-gsm-tester_run-prod/osmo-gsm-tester/src/osmo_gsm_tester/core/remote.py", line 146, in recreate_remote_dir
    self.rm_remote_dir(remote_dir)
  File "/home/jenkins/workspace/osmo-gsm-tester_run-prod/osmo-gsm-tester/src/osmo_gsm_tester/core/remote.py", line 139, in rm_remote_dir
    self.run_remote_sync('rm-remote-dir', ('test', '!', '-d', remote_dir_str, '||', 'rm', '-rf', remote_dir_str))
  File "/home/jenkins/workspace/osmo-gsm-tester_run-prod/osmo-gsm-tester/src/osmo_gsm_tester/core/remote.py", line 134, in run_remote_sync
    proc.launch_sync()
  File "/home/jenkins/workspace/osmo-gsm-tester_run-prod/osmo-gsm-tester/src/osmo_gsm_tester/core/process.py", line 214, in launch_sync
    raise e
  File "/home/jenkins/workspace/osmo-gsm-tester_run-prod/osmo-gsm-tester/src/osmo_gsm_tester/core/process.py", line 211, in launch_sync
    self.wait()
  File "/home/jenkins/workspace/osmo-gsm-tester_run-prod/osmo-gsm-tester/src/osmo_gsm_tester/core/process.py", line 421, in wait
    MainLoop.wait(self.terminated, timeout=timeout)
  File "/home/jenkins/workspace/osmo-gsm-tester_run-prod/osmo-gsm-tester/src/osmo_gsm_tester/core/event_loop.py", line 108, in wait
    if not self.wait_no_raise(condition, condition_args, condition_kwargs, timeout, timestep):
  File "/home/jenkins/workspace/osmo-gsm-tester_run-prod/osmo-gsm-tester/src/osmo_gsm_tester/core/event_loop.py", line 98, in wait_no_raise
    self.poll(may_block=True)
  File "/home/jenkins/workspace/osmo-gsm-tester_run-prod/osmo-gsm-tester/src/osmo_gsm_tester/core/event_loop.py", line 86, in poll
    self.deferred_handling.handle_queue()
  File "/home/jenkins/workspace/osmo-gsm-tester_run-prod/osmo-gsm-tester/src/osmo_gsm_tester/core/event_loop.py", line 33, in handle_queue
    handler(*args, **kwargs)
  File "/home/jenkins/workspace/osmo-gsm-tester_run-prod/osmo-gsm-tester/src/osmo_gsm_tester/testenv.py", line 142, in poll
    raise log_module.Error('Process ended prematurely: %s' % proc.name())
osmo_gsm_tester.core.log.Error: srsepc(pid=19588): Process ended prematurely: srsepc(pid=19588) [trial-2368↪4g:srsenb-rftype@zmq+srsue-rftype@zmq↪handover.py:37↪handover.py↪srsepc_10.42.42.118↪host-jenkins@10.42.42.116↪srsepc(pid=19588)]