Skip to content

Failed

4g:srsenb-rftype@zmq+srsue-rftype@zmq.iperf3_dl.py (from 4g_srsenb-rftype@zmq+srsue-rftype@zmq)

Failing for the past 237 builds (Since #2139 )
Took 19 sec.

Stacktrace

srsepc(pid=16288): Process ended prematurely: srsepc(pid=16288) [trial-2375↪4g:srsenb-rftype@zmq+srsue-rftype@zmq↪iperf3_dl.py:42↪iperf3_dl.py↪srsepc_10.42.42.118↪host-jenkins@10.42.42.116↪srsepc(pid=16288)]

Standard Output

----------------------------------------------
trial-2375 4g:srsenb-rftype@zmq+srsue-rftype@zmq iperf3_dl.py
----------------------------------------------
13:57:12.950652 tst                  iperf3_dl.py:13: Number of physical ue: 1
13:57:12.991755 tst 4g:srsenb-rftype@zmq+srsue-rftype@zmq: Using 1 x modem (candidates: 1)
13:57:13.195326 tst                  iperf3_dl.py:20: ue index0: srsue_10.42.42.116
13:57:13.236462 tst 4g:srsenb-rftype@zmq+srsue-rftype@zmq: Using 1 x run_node (candidates: 1)
13:57:13.251821 tst 4g:srsenb-rftype@zmq+srsue-rftype@zmq: Using 1 x enb (candidates: 1)
13:57:13.373369 tst                     iperf3_dl.py: using MSISDN 7777
13:57:13.480085 run              srsepc_10.42.42.118: Add subscriber {algo_str='mil', imsi='001010123456789', msisdn='7777', subscriber_id=0}
13:57:13.585986 run              srsepc_10.42.42.118: Starting srsepc
13:57:14.220590 run         rm-remote-dir(pid=16276): Launched
13:57:15.406465 run         rm-remote-dir(pid=16276): Terminated: ok {rc=0}
13:57:15.730192 run         mk-remote-dir(pid=16277): Launched
13:57:16.966870 run         mk-remote-dir(pid=16277): Terminated: ok {rc=0}
13:57:17.305018 run    scp-inst-to-remote(pid=16278): Launched
13:57:19.488554 run    scp-inst-to-remote(pid=16278): Terminated: ok {rc=0}
13:57:19.811683 run         rm-remote-dir(pid=16280): Launched
13:57:20.996144 run         rm-remote-dir(pid=16280): Terminated: ok {rc=0}
13:57:21.322985 run         mk-remote-dir(pid=16281): Launched
13:57:22.508456 run         mk-remote-dir(pid=16281): Terminated: ok {rc=0}
13:57:22.782129 run     scp-cfg-to-remote(pid=16282): Launched
13:57:23.964236 run     scp-cfg-to-remote(pid=16282): Terminated: ok {rc=0}
13:57:24.236815 run      scp-db-to-remote(pid=16284): Launched
13:57:25.419630 run      scp-db-to-remote(pid=16284): Terminated: ok {rc=0}
13:57:25.532072 run              srsepc_10.42.42.118: Setting RPATH for srsepc
13:57:25.846499 run              patchelf(pid=16286): Launched
13:57:27.029974 run              patchelf(pid=16286): Terminated: ok {rc=0}
13:57:27.142074 run              srsepc_10.42.42.118: Applying CAP_NET_ADMIN capability to srsepc
13:57:27.456568 run         setcap-netadm(pid=16287): Launched
13:57:28.640747 run         setcap-netadm(pid=16287): Terminated: ok {rc=0}
13:57:28.947911 run                srsepc(pid=16288): Launched
13:57:29.055180 run   srsenb_srsENB-zmq_10.42.42.117: Starting srsENB
13:57:30.166047 run         rm-remote-dir(pid=16289): Launched
13:57:30.350203 run                srsepc(pid=16288): ERR: Terminated: ERROR {rc=127}  [trial-2375↪4g:srsenb-rftype@zmq+srsue-rftype@zmq↪iperf3_dl.py:42↪iperf3_dl.py↪srsepc_10.42.42.118↪host-jenkins@10.42.42.116↪srsepc(pid=16288)]
13:57:30.484646 run                srsepc(pid=16288): stdout: 
| (launched: 2022-12-10_13:57:28.800819)
| /osmo-gsm-tester-srsepc/srslte/bin/srsepc: error while loading shared libraries: libboost_program_options.so.1.62.0: cannot open shared object file: No such file or directory 
13:57:30.618541 run                srsepc(pid=16288): stderr: 
| (launched: 2022-12-10_13:57:28.846103)
| Connection to 10.42.42.116 closed. 
13:57:30.747807 run                srsepc(pid=16288): stdout: 
| (launched: 2022-12-10_13:57:28.800819)
| /osmo-gsm-tester-srsepc/srslte/bin/srsepc: error while loading shared libraries: libboost_program_options.so.1.62.0: cannot open shared object file: No such file or directory 
13:57:30.898593 run                srsepc(pid=16288): stderr: 
| (launched: 2022-12-10_13:57:28.846103)
| Connection to 10.42.42.116 closed. 
13:57:31.051705 run         rm-remote-dir(pid=16289): Terminating (SIGINT)
13:57:31.231265 run         rm-remote-dir(pid=16289): Terminated: ok {rc=0}
13:57:31.264746 tst                  iperf3_dl.py:42: ERR: Error: srsepc(pid=16288): Process ended prematurely: srsepc(pid=16288) [trial-2375↪4g:srsenb-rftype@zmq+srsue-rftype@zmq↪iperf3_dl.py:42↪iperf3_dl.py↪srsepc_10.42.42.118↪host-jenkins@10.42.42.116↪srsepc(pid=16288)]  [trial-2375↪4g:srsenb-rftype@zmq+srsue-rftype@zmq↪iperf3_dl.py:42]
13:57:31.275161 tst                  iperf3_dl.py:42: Test FAILED (18.5 sec)
13:57:31.405027 run          scp-back-log(pid=16290): Launched
13:57:32.504927 run          scp-back-log(pid=16290): ERR: Terminated: ERROR {rc=1}  [trial-2375↪4g:srsenb-rftype@zmq+srsue-rftype@zmq↪iperf3_dl.py↪iperf3_dl.py↪srsepc_10.42.42.118↪host-jenkins@10.42.42.116↪scp-back-log(pid=16290)]
13:57:32.566813 run          scp-back-log(pid=16290): stdout: 
| (launched: 2022-12-10_13:57:31.316740) 
13:57:32.628764 run          scp-back-log(pid=16290): stderr: 
| (launched: 2022-12-10_13:57:31.336659)
| scp: /osmo-gsm-tester-srsepc/srsepc/srsepc.log: No such file or directory 
13:57:32.680792 tst              srsepc_10.42.42.118: Error('scp-back-log(pid=16290): launch_sync(): local process exited with status 1 [trial-2375↪4g:srsenb-rftype@zmq+srsue-rftype@zmq↪iperf3_dl.py↪iperf3_dl.py↪srsepc_10.42.42.118↪host-jenkins@10.42.42.116↪scp-back-log(pid=16290)]')

Standard Error

Traceback (most recent call last):
  File "/home/jenkins/workspace/osmo-gsm-tester_run-prod/osmo-gsm-tester/src/osmo_gsm_tester/core/test.py", line 76, in run
    self.path)
  File "/home/jenkins/workspace/osmo-gsm-tester_run-prod/osmo-gsm-tester/src/osmo_gsm_tester/core/util.py", line 414, in run_python_file
    spec.loader.exec_module( importlib.util.module_from_spec(spec) )
  File "<frozen importlib._bootstrap_external>", line 728, in exec_module
  File "<frozen importlib._bootstrap>", line 219, in _call_with_frames_removed
  File "/home/jenkins/workspace/osmo-gsm-tester_run-prod/osmo-gsm-tester/sysmocom/suites/4g/iperf3_dl.py", line 42, in <module>
    enb.start(epc)
  File "/home/jenkins/workspace/osmo-gsm-tester_run-prod/osmo-gsm-tester/src/osmo_gsm_tester/obj/enb_srs.py", line 237, in start
    self.configure()
  File "/home/jenkins/workspace/osmo-gsm-tester_run-prod/osmo-gsm-tester/src/osmo_gsm_tester/obj/enb_srs.py", line 423, in configure
    self.rem_host.recreate_remote_dir(self.remote_inst)
  File "/home/jenkins/workspace/osmo-gsm-tester_run-prod/osmo-gsm-tester/src/osmo_gsm_tester/core/remote.py", line 146, in recreate_remote_dir
    self.rm_remote_dir(remote_dir)
  File "/home/jenkins/workspace/osmo-gsm-tester_run-prod/osmo-gsm-tester/src/osmo_gsm_tester/core/remote.py", line 139, in rm_remote_dir
    self.run_remote_sync('rm-remote-dir', ('test', '!', '-d', remote_dir_str, '||', 'rm', '-rf', remote_dir_str))
  File "/home/jenkins/workspace/osmo-gsm-tester_run-prod/osmo-gsm-tester/src/osmo_gsm_tester/core/remote.py", line 134, in run_remote_sync
    proc.launch_sync()
  File "/home/jenkins/workspace/osmo-gsm-tester_run-prod/osmo-gsm-tester/src/osmo_gsm_tester/core/process.py", line 214, in launch_sync
    raise e
  File "/home/jenkins/workspace/osmo-gsm-tester_run-prod/osmo-gsm-tester/src/osmo_gsm_tester/core/process.py", line 211, in launch_sync
    self.wait()
  File "/home/jenkins/workspace/osmo-gsm-tester_run-prod/osmo-gsm-tester/src/osmo_gsm_tester/core/process.py", line 421, in wait
    MainLoop.wait(self.terminated, timeout=timeout)
  File "/home/jenkins/workspace/osmo-gsm-tester_run-prod/osmo-gsm-tester/src/osmo_gsm_tester/core/event_loop.py", line 108, in wait
    if not self.wait_no_raise(condition, condition_args, condition_kwargs, timeout, timestep):
  File "/home/jenkins/workspace/osmo-gsm-tester_run-prod/osmo-gsm-tester/src/osmo_gsm_tester/core/event_loop.py", line 98, in wait_no_raise
    self.poll(may_block=True)
  File "/home/jenkins/workspace/osmo-gsm-tester_run-prod/osmo-gsm-tester/src/osmo_gsm_tester/core/event_loop.py", line 86, in poll
    self.deferred_handling.handle_queue()
  File "/home/jenkins/workspace/osmo-gsm-tester_run-prod/osmo-gsm-tester/src/osmo_gsm_tester/core/event_loop.py", line 33, in handle_queue
    handler(*args, **kwargs)
  File "/home/jenkins/workspace/osmo-gsm-tester_run-prod/osmo-gsm-tester/src/osmo_gsm_tester/testenv.py", line 142, in poll
    raise log_module.Error('Process ended prematurely: %s' % proc.name())
osmo_gsm_tester.core.log.Error: srsepc(pid=16288): Process ended prematurely: srsepc(pid=16288) [trial-2375↪4g:srsenb-rftype@zmq+srsue-rftype@zmq↪iperf3_dl.py:42↪iperf3_dl.py↪srsepc_10.42.42.118↪host-jenkins@10.42.42.116↪srsepc(pid=16288)]