Skip to content

Failed

4g:srsenb-rftype@zmq+srsue-rftype@zmq.rrc_idle_mt_ping.py (from 4g_srsenb-rftype@zmq+srsue-rftype@zmq)

Failing for the past 244 builds (Since #2139 )
Took 19 sec.

Stacktrace

srsepc(pid=32435): Process ended prematurely: srsepc(pid=32435) [trial-2382↪4g:srsenb-rftype@zmq+srsue-rftype@zmq↪rrc_idle_mt_ping.py:16↪rrc_idle_mt_ping.py↪srsepc_10.42.42.118↪host-jenkins@10.42.42.116↪srsepc(pid=32435)]

Standard Output

----------------------------------------------
trial-2382 4g:srsenb-rftype@zmq+srsue-rftype@zmq rrc_idle_mt_ping.py
----------------------------------------------
21:55:31.574038 tst 4g:srsenb-rftype@zmq+srsue-rftype@zmq: Using 1 x run_node (candidates: 1)
21:55:31.595335 tst 4g:srsenb-rftype@zmq+srsue-rftype@zmq: Using 1 x enb (candidates: 1)
21:55:31.631051 tst 4g:srsenb-rftype@zmq+srsue-rftype@zmq: Using 1 x modem (candidates: 1)
21:55:31.814514 tst              rrc_idle_mt_ping.py: using MSISDN 7999
21:55:31.949677 run              srsepc_10.42.42.118: Add subscriber {algo_str='mil', imsi='001010123456789', msisdn='7999', subscriber_id=0}
21:55:32.060675 run              srsepc_10.42.42.118: Starting srsepc
21:55:32.709544 run         rm-remote-dir(pid=32423): Launched
21:55:33.899525 run         rm-remote-dir(pid=32423): Terminated: ok {rc=0}
21:55:34.227414 run         mk-remote-dir(pid=32424): Launched
21:55:35.416590 run         mk-remote-dir(pid=32424): Terminated: ok {rc=0}
21:55:35.692824 run    scp-inst-to-remote(pid=32425): Launched
21:55:37.891371 run    scp-inst-to-remote(pid=32425): Terminated: ok {rc=0}
21:55:38.244028 run         rm-remote-dir(pid=32427): Launched
21:55:39.446063 run         rm-remote-dir(pid=32427): Terminated: ok {rc=0}
21:55:39.799121 run         mk-remote-dir(pid=32428): Launched
21:55:41.000643 run         mk-remote-dir(pid=32428): Terminated: ok {rc=0}
21:55:41.299113 run     scp-cfg-to-remote(pid=32429): Launched
21:55:42.486335 run     scp-cfg-to-remote(pid=32429): Terminated: ok {rc=0}
21:55:42.763205 run      scp-db-to-remote(pid=32431): Launched
21:55:43.949512 run      scp-db-to-remote(pid=32431): Terminated: ok {rc=0}
21:55:44.064148 run              srsepc_10.42.42.118: Setting RPATH for srsepc
21:55:44.382347 run              patchelf(pid=32433): Launched
21:55:45.568874 run              patchelf(pid=32433): Terminated: ok {rc=0}
21:55:45.683669 run              srsepc_10.42.42.118: Applying CAP_NET_ADMIN capability to srsepc
21:55:46.064167 run         setcap-netadm(pid=32434): Launched
21:55:47.293991 run         setcap-netadm(pid=32434): Terminated: ok {rc=0}
21:55:47.630634 run                srsepc(pid=32435): Launched
21:55:47.748581 run   srsenb_srsENB-zmq_10.42.42.117: Starting srsENB
21:55:48.961373 run         rm-remote-dir(pid=32436): Launched
21:55:49.163279 run                srsepc(pid=32435): ERR: Terminated: ERROR {rc=127}  [trial-2382↪4g:srsenb-rftype@zmq+srsue-rftype@zmq↪rrc_idle_mt_ping.py:16↪rrc_idle_mt_ping.py↪srsepc_10.42.42.118↪host-jenkins@10.42.42.116↪srsepc(pid=32435)]
21:55:49.308818 run                srsepc(pid=32435): stdout: 
| (launched: 2022-12-12_21:55:47.470649)
| /osmo-gsm-tester-srsepc/srslte/bin/srsepc: error while loading shared libraries: libboost_program_options.so.1.62.0: cannot open shared object file: No such file or directory 
21:55:49.454561 run                srsepc(pid=32435): stderr: 
| (launched: 2022-12-12_21:55:47.520183)
| Connection to 10.42.42.116 closed. 
21:55:49.595582 run                srsepc(pid=32435): stdout: 
| (launched: 2022-12-12_21:55:47.470649)
| /osmo-gsm-tester-srsepc/srslte/bin/srsepc: error while loading shared libraries: libboost_program_options.so.1.62.0: cannot open shared object file: No such file or directory 
21:55:49.735564 run                srsepc(pid=32435): stderr: 
| (launched: 2022-12-12_21:55:47.520183)
| Connection to 10.42.42.116 closed. 
21:55:49.899250 run         rm-remote-dir(pid=32436): Terminating (SIGINT)
21:55:50.091857 run         rm-remote-dir(pid=32436): Terminated: ok {rc=0}
21:55:50.127096 tst           rrc_idle_mt_ping.py:16: ERR: Error: srsepc(pid=32435): Process ended prematurely: srsepc(pid=32435) [trial-2382↪4g:srsenb-rftype@zmq+srsue-rftype@zmq↪rrc_idle_mt_ping.py:16↪rrc_idle_mt_ping.py↪srsepc_10.42.42.118↪host-jenkins@10.42.42.116↪srsepc(pid=32435)]  [trial-2382↪4g:srsenb-rftype@zmq+srsue-rftype@zmq↪rrc_idle_mt_ping.py:16]
21:55:50.137359 tst           rrc_idle_mt_ping.py:16: Test FAILED (18.6 sec)
21:55:50.253590 run          scp-back-log(pid=32437): Launched
21:55:51.345134 run          scp-back-log(pid=32437): ERR: Terminated: ERROR {rc=1}  [trial-2382↪4g:srsenb-rftype@zmq+srsue-rftype@zmq↪rrc_idle_mt_ping.py↪rrc_idle_mt_ping.py↪srsepc_10.42.42.118↪host-jenkins@10.42.42.116↪scp-back-log(pid=32437)]
21:55:51.411422 run          scp-back-log(pid=32437): stdout: 
| (launched: 2022-12-12_21:55:50.180714) 
21:55:51.477886 run          scp-back-log(pid=32437): stderr: 
| (launched: 2022-12-12_21:55:50.201849)
| scp: /osmo-gsm-tester-srsepc/srsepc/srsepc.log: No such file or directory 
21:55:51.534035 tst              srsepc_10.42.42.118: Error('scp-back-log(pid=32437): launch_sync(): local process exited with status 1 [trial-2382↪4g:srsenb-rftype@zmq+srsue-rftype@zmq↪rrc_idle_mt_ping.py↪rrc_idle_mt_ping.py↪srsepc_10.42.42.118↪host-jenkins@10.42.42.116↪scp-back-log(pid=32437)]')

Standard Error

Traceback (most recent call last):
  File "/home/jenkins/workspace/osmo-gsm-tester_run-prod/osmo-gsm-tester/src/osmo_gsm_tester/core/test.py", line 76, in run
    self.path)
  File "/home/jenkins/workspace/osmo-gsm-tester_run-prod/osmo-gsm-tester/src/osmo_gsm_tester/core/util.py", line 414, in run_python_file
    spec.loader.exec_module( importlib.util.module_from_spec(spec) )
  File "<frozen importlib._bootstrap_external>", line 728, in exec_module
  File "<frozen importlib._bootstrap>", line 219, in _call_with_frames_removed
  File "/home/jenkins/workspace/osmo-gsm-tester_run-prod/osmo-gsm-tester/sysmocom/suites/4g/rrc_idle_mt_ping.py", line 16, in <module>
    enb.start(epc)
  File "/home/jenkins/workspace/osmo-gsm-tester_run-prod/osmo-gsm-tester/src/osmo_gsm_tester/obj/enb_srs.py", line 237, in start
    self.configure()
  File "/home/jenkins/workspace/osmo-gsm-tester_run-prod/osmo-gsm-tester/src/osmo_gsm_tester/obj/enb_srs.py", line 423, in configure
    self.rem_host.recreate_remote_dir(self.remote_inst)
  File "/home/jenkins/workspace/osmo-gsm-tester_run-prod/osmo-gsm-tester/src/osmo_gsm_tester/core/remote.py", line 146, in recreate_remote_dir
    self.rm_remote_dir(remote_dir)
  File "/home/jenkins/workspace/osmo-gsm-tester_run-prod/osmo-gsm-tester/src/osmo_gsm_tester/core/remote.py", line 139, in rm_remote_dir
    self.run_remote_sync('rm-remote-dir', ('test', '!', '-d', remote_dir_str, '||', 'rm', '-rf', remote_dir_str))
  File "/home/jenkins/workspace/osmo-gsm-tester_run-prod/osmo-gsm-tester/src/osmo_gsm_tester/core/remote.py", line 134, in run_remote_sync
    proc.launch_sync()
  File "/home/jenkins/workspace/osmo-gsm-tester_run-prod/osmo-gsm-tester/src/osmo_gsm_tester/core/process.py", line 214, in launch_sync
    raise e
  File "/home/jenkins/workspace/osmo-gsm-tester_run-prod/osmo-gsm-tester/src/osmo_gsm_tester/core/process.py", line 211, in launch_sync
    self.wait()
  File "/home/jenkins/workspace/osmo-gsm-tester_run-prod/osmo-gsm-tester/src/osmo_gsm_tester/core/process.py", line 421, in wait
    MainLoop.wait(self.terminated, timeout=timeout)
  File "/home/jenkins/workspace/osmo-gsm-tester_run-prod/osmo-gsm-tester/src/osmo_gsm_tester/core/event_loop.py", line 108, in wait
    if not self.wait_no_raise(condition, condition_args, condition_kwargs, timeout, timestep):
  File "/home/jenkins/workspace/osmo-gsm-tester_run-prod/osmo-gsm-tester/src/osmo_gsm_tester/core/event_loop.py", line 98, in wait_no_raise
    self.poll(may_block=True)
  File "/home/jenkins/workspace/osmo-gsm-tester_run-prod/osmo-gsm-tester/src/osmo_gsm_tester/core/event_loop.py", line 86, in poll
    self.deferred_handling.handle_queue()
  File "/home/jenkins/workspace/osmo-gsm-tester_run-prod/osmo-gsm-tester/src/osmo_gsm_tester/core/event_loop.py", line 33, in handle_queue
    handler(*args, **kwargs)
  File "/home/jenkins/workspace/osmo-gsm-tester_run-prod/osmo-gsm-tester/src/osmo_gsm_tester/testenv.py", line 142, in poll
    raise log_module.Error('Process ended prematurely: %s' % proc.name())
osmo_gsm_tester.core.log.Error: srsepc(pid=32435): Process ended prematurely: srsepc(pid=32435) [trial-2382↪4g:srsenb-rftype@zmq+srsue-rftype@zmq↪rrc_idle_mt_ping.py:16↪rrc_idle_mt_ping.py↪srsepc_10.42.42.118↪host-jenkins@10.42.42.116↪srsepc(pid=32435)]