Skip to content

Failed

4g:srsenb-rftype@zmq+srsue-rftype@zmq.handover.py (from 4g_srsenb-rftype@zmq+srsue-rftype@zmq)

Failing for the past 246 builds (Since #2139 )
Took 21 sec.

Stacktrace

srsepc(pid=17212): Process ended prematurely: srsepc(pid=17212) [trial-2384↪4g:srsenb-rftype@zmq+srsue-rftype@zmq↪handover.py:37↪handover.py↪srsepc_10.42.42.118↪host-jenkins@10.42.42.116↪srsepc(pid=17212)]

Standard Output

----------------------------------------------
trial-2384 4g:srsenb-rftype@zmq+srsue-rftype@zmq handover.py
----------------------------------------------
01:25:35.309275 tst                   handover.py:11: TEST_CONFIG:
{}
01:25:35.355880 tst 4g:srsenb-rftype@zmq+srsue-rftype@zmq: Using 1 x run_node (candidates: 1)
01:25:35.372412 tst 4g:srsenb-rftype@zmq+srsue-rftype@zmq: Using 1 x enb (candidates: 1)
01:25:35.396927 tst 4g:srsenb-rftype@zmq+srsue-rftype@zmq: Using 1 x modem (candidates: 1)
01:25:35.550088 tst                      handover.py: using MSISDN 8063
01:25:35.670940 run              srsepc_10.42.42.118: Add subscriber {algo_str='mil', imsi='001010123456789', msisdn='8063', subscriber_id=0}
01:25:35.790273 run              srsepc_10.42.42.118: Starting srsepc
01:25:37.760880 run         rm-remote-dir(pid=17200): Launched
01:25:37.963764 bus                        /sierra_2: Setting Powered False
01:25:38.990742 run         rm-remote-dir(pid=17200): Terminated: ok {rc=0}
01:25:39.436197 run         mk-remote-dir(pid=17201): Launched
01:25:40.631187 run         mk-remote-dir(pid=17201): Terminated: ok {rc=0}
01:25:40.920720 run    scp-inst-to-remote(pid=17202): Launched
01:25:43.113317 run    scp-inst-to-remote(pid=17202): Terminated: ok {rc=0}
01:25:43.456368 run         rm-remote-dir(pid=17204): Launched
01:25:44.650482 run         rm-remote-dir(pid=17204): Terminated: ok {rc=0}
01:25:44.992680 run         mk-remote-dir(pid=17205): Launched
01:25:46.203007 run         mk-remote-dir(pid=17205): Terminated: ok {rc=0}
01:25:46.594540 run     scp-cfg-to-remote(pid=17206): Launched
01:25:47.824701 run     scp-cfg-to-remote(pid=17206): Terminated: ok {rc=0}
01:25:48.114761 run      scp-db-to-remote(pid=17208): Launched
01:25:49.307142 run      scp-db-to-remote(pid=17208): Terminated: ok {rc=0}
01:25:49.424743 run              srsepc_10.42.42.118: Setting RPATH for srsepc
01:25:49.758511 run              patchelf(pid=17210): Launched
01:25:50.959037 run              patchelf(pid=17210): Terminated: ok {rc=0}
01:25:51.085533 run              srsepc_10.42.42.118: Applying CAP_NET_ADMIN capability to srsepc
01:25:51.438724 run         setcap-netadm(pid=17211): Launched
01:25:52.642924 run         setcap-netadm(pid=17211): Terminated: ok {rc=0}
01:25:52.988468 run                srsepc(pid=17212): Launched
01:25:53.110387 run   srsenb_srsENB-zmq_10.42.42.117: Starting srsENB
01:25:54.345176 run         rm-remote-dir(pid=17213): Launched
01:25:54.548675 run                srsepc(pid=17212): ERR: Terminated: ERROR {rc=127}  [trial-2384↪4g:srsenb-rftype@zmq+srsue-rftype@zmq↪handover.py:37↪handover.py↪srsepc_10.42.42.118↪host-jenkins@10.42.42.116↪srsepc(pid=17212)]
01:25:54.697420 run                srsepc(pid=17212): stdout: 
| (launched: 2022-12-13_01:25:52.823382)
| /osmo-gsm-tester-srsepc/srslte/bin/srsepc: error while loading shared libraries: libboost_program_options.so.1.62.0: cannot open shared object file: No such file or directory 
01:25:54.846121 run                srsepc(pid=17212): stderr: 
| (launched: 2022-12-13_01:25:52.874511)
| Connection to 10.42.42.116 closed. 
01:25:54.990426 run                srsepc(pid=17212): stdout: 
| (launched: 2022-12-13_01:25:52.823382)
| /osmo-gsm-tester-srsepc/srslte/bin/srsepc: error while loading shared libraries: libboost_program_options.so.1.62.0: cannot open shared object file: No such file or directory 
01:25:55.133630 run                srsepc(pid=17212): stderr: 
| (launched: 2022-12-13_01:25:52.874511)
| Connection to 10.42.42.116 closed. 
01:25:55.300531 run         rm-remote-dir(pid=17213): Terminating (SIGINT)
01:25:55.496396 run         rm-remote-dir(pid=17213): Terminated: ok {rc=0}
01:25:55.532357 tst                   handover.py:37: ERR: Error: srsepc(pid=17212): Process ended prematurely: srsepc(pid=17212) [trial-2384↪4g:srsenb-rftype@zmq+srsue-rftype@zmq↪handover.py:37↪handover.py↪srsepc_10.42.42.118↪host-jenkins@10.42.42.116↪srsepc(pid=17212)]  [trial-2384↪4g:srsenb-rftype@zmq+srsue-rftype@zmq↪handover.py:37]
01:25:55.542753 tst                   handover.py:37: Test FAILED (20.4 sec)
01:25:55.661366 run          scp-back-log(pid=17214): Launched
01:25:56.754567 run          scp-back-log(pid=17214): ERR: Terminated: ERROR {rc=1}  [trial-2384↪4g:srsenb-rftype@zmq+srsue-rftype@zmq↪handover.py↪handover.py↪srsepc_10.42.42.118↪host-jenkins@10.42.42.116↪scp-back-log(pid=17214)]
01:25:56.820898 run          scp-back-log(pid=17214): stdout: 
| (launched: 2022-12-13_01:25:55.587010) 
01:25:56.887874 run          scp-back-log(pid=17214): stderr: 
| (launched: 2022-12-13_01:25:55.607962)
| scp: /osmo-gsm-tester-srsepc/srsepc/srsepc.log: No such file or directory 
01:25:56.944495 tst              srsepc_10.42.42.118: Error('scp-back-log(pid=17214): launch_sync(): local process exited with status 1 [trial-2384↪4g:srsenb-rftype@zmq+srsue-rftype@zmq↪handover.py↪handover.py↪srsepc_10.42.42.118↪host-jenkins@10.42.42.116↪scp-back-log(pid=17214)]')

Standard Error

Traceback (most recent call last):
  File "/home/jenkins/workspace/osmo-gsm-tester_run-prod/osmo-gsm-tester/src/osmo_gsm_tester/core/test.py", line 76, in run
    self.path)
  File "/home/jenkins/workspace/osmo-gsm-tester_run-prod/osmo-gsm-tester/src/osmo_gsm_tester/core/util.py", line 414, in run_python_file
    spec.loader.exec_module( importlib.util.module_from_spec(spec) )
  File "<frozen importlib._bootstrap_external>", line 728, in exec_module
  File "<frozen importlib._bootstrap>", line 219, in _call_with_frames_removed
  File "/home/jenkins/workspace/osmo-gsm-tester_run-prod/osmo-gsm-tester/sysmocom/suites/4g/handover.py", line 37, in <module>
    enb.start(epc)
  File "/home/jenkins/workspace/osmo-gsm-tester_run-prod/osmo-gsm-tester/src/osmo_gsm_tester/obj/enb_srs.py", line 237, in start
    self.configure()
  File "/home/jenkins/workspace/osmo-gsm-tester_run-prod/osmo-gsm-tester/src/osmo_gsm_tester/obj/enb_srs.py", line 423, in configure
    self.rem_host.recreate_remote_dir(self.remote_inst)
  File "/home/jenkins/workspace/osmo-gsm-tester_run-prod/osmo-gsm-tester/src/osmo_gsm_tester/core/remote.py", line 146, in recreate_remote_dir
    self.rm_remote_dir(remote_dir)
  File "/home/jenkins/workspace/osmo-gsm-tester_run-prod/osmo-gsm-tester/src/osmo_gsm_tester/core/remote.py", line 139, in rm_remote_dir
    self.run_remote_sync('rm-remote-dir', ('test', '!', '-d', remote_dir_str, '||', 'rm', '-rf', remote_dir_str))
  File "/home/jenkins/workspace/osmo-gsm-tester_run-prod/osmo-gsm-tester/src/osmo_gsm_tester/core/remote.py", line 134, in run_remote_sync
    proc.launch_sync()
  File "/home/jenkins/workspace/osmo-gsm-tester_run-prod/osmo-gsm-tester/src/osmo_gsm_tester/core/process.py", line 214, in launch_sync
    raise e
  File "/home/jenkins/workspace/osmo-gsm-tester_run-prod/osmo-gsm-tester/src/osmo_gsm_tester/core/process.py", line 211, in launch_sync
    self.wait()
  File "/home/jenkins/workspace/osmo-gsm-tester_run-prod/osmo-gsm-tester/src/osmo_gsm_tester/core/process.py", line 421, in wait
    MainLoop.wait(self.terminated, timeout=timeout)
  File "/home/jenkins/workspace/osmo-gsm-tester_run-prod/osmo-gsm-tester/src/osmo_gsm_tester/core/event_loop.py", line 108, in wait
    if not self.wait_no_raise(condition, condition_args, condition_kwargs, timeout, timestep):
  File "/home/jenkins/workspace/osmo-gsm-tester_run-prod/osmo-gsm-tester/src/osmo_gsm_tester/core/event_loop.py", line 98, in wait_no_raise
    self.poll(may_block=True)
  File "/home/jenkins/workspace/osmo-gsm-tester_run-prod/osmo-gsm-tester/src/osmo_gsm_tester/core/event_loop.py", line 86, in poll
    self.deferred_handling.handle_queue()
  File "/home/jenkins/workspace/osmo-gsm-tester_run-prod/osmo-gsm-tester/src/osmo_gsm_tester/core/event_loop.py", line 33, in handle_queue
    handler(*args, **kwargs)
  File "/home/jenkins/workspace/osmo-gsm-tester_run-prod/osmo-gsm-tester/src/osmo_gsm_tester/testenv.py", line 142, in poll
    raise log_module.Error('Process ended prematurely: %s' % proc.name())
osmo_gsm_tester.core.log.Error: srsepc(pid=17212): Process ended prematurely: srsepc(pid=17212) [trial-2384↪4g:srsenb-rftype@zmq+srsue-rftype@zmq↪handover.py:37↪handover.py↪srsepc_10.42.42.118↪host-jenkins@10.42.42.116↪srsepc(pid=17212)]