Skip to content

Failed

4g:srsenb-rftype@zmq+srsue-rftype@zmq.iperf3_ul.py (from 4g_srsenb-rftype@zmq+srsue-rftype@zmq)

Failing for the past 246 builds (Since #2139 )
Took 19 sec.

Stacktrace

srsepc(pid=17260): Process ended prematurely: srsepc(pid=17260) [trial-2384↪4g:srsenb-rftype@zmq+srsue-rftype@zmq↪iperf3_ul.py:42↪iperf3_ul.py↪srsepc_10.42.42.118↪host-jenkins@10.42.42.116↪srsepc(pid=17260)]

Standard Output

----------------------------------------------
trial-2384 4g:srsenb-rftype@zmq+srsue-rftype@zmq iperf3_ul.py
----------------------------------------------
01:26:38.544901 tst                  iperf3_ul.py:13: Number of physical ue: 1
01:26:38.591446 tst 4g:srsenb-rftype@zmq+srsue-rftype@zmq: Using 1 x modem (candidates: 1)
01:26:38.823091 tst                  iperf3_ul.py:20: ue index0: srsue_10.42.42.116
01:26:38.869723 tst 4g:srsenb-rftype@zmq+srsue-rftype@zmq: Using 1 x run_node (candidates: 1)
01:26:38.886387 tst 4g:srsenb-rftype@zmq+srsue-rftype@zmq: Using 1 x enb (candidates: 1)
01:26:39.012278 tst                     iperf3_ul.py: using MSISDN 8066
01:26:39.124727 run              srsepc_10.42.42.118: Add subscriber {algo_str='mil', imsi='001010123456789', msisdn='8066', subscriber_id=0}
01:26:39.236369 run              srsepc_10.42.42.118: Starting srsepc
01:26:39.903910 run         rm-remote-dir(pid=17248): Launched
01:26:41.097807 run         rm-remote-dir(pid=17248): Terminated: ok {rc=0}
01:26:41.439561 run         mk-remote-dir(pid=17249): Launched
01:26:42.633092 run         mk-remote-dir(pid=17249): Terminated: ok {rc=0}
01:26:42.921986 run    scp-inst-to-remote(pid=17250): Launched
01:26:45.125984 run    scp-inst-to-remote(pid=17250): Terminated: ok {rc=0}
01:26:45.491103 run         rm-remote-dir(pid=17252): Launched
01:26:46.699749 run         rm-remote-dir(pid=17252): Terminated: ok {rc=0}
01:26:47.125837 run         mk-remote-dir(pid=17253): Launched
01:26:48.351716 run         mk-remote-dir(pid=17253): Terminated: ok {rc=0}
01:26:48.643748 run     scp-cfg-to-remote(pid=17254): Launched
01:26:49.834845 run     scp-cfg-to-remote(pid=17254): Terminated: ok {rc=0}
01:26:50.123595 run      scp-db-to-remote(pid=17256): Launched
01:26:51.316053 run      scp-db-to-remote(pid=17256): Terminated: ok {rc=0}
01:26:51.433548 run              srsepc_10.42.42.118: Setting RPATH for srsepc
01:26:51.766917 run              patchelf(pid=17258): Launched
01:26:52.958498 run              patchelf(pid=17258): Terminated: ok {rc=0}
01:26:53.075811 run              srsepc_10.42.42.118: Applying CAP_NET_ADMIN capability to srsepc
01:26:53.409408 run         setcap-netadm(pid=17259): Launched
01:26:54.600014 run         setcap-netadm(pid=17259): Terminated: ok {rc=0}
01:26:54.925435 run                srsepc(pid=17260): Launched
01:26:55.038330 run   srsenb_srsENB-zmq_10.42.42.117: Starting srsENB
01:26:56.200355 run         rm-remote-dir(pid=17261): Launched
01:26:56.393580 run                srsepc(pid=17260): ERR: Terminated: ERROR {rc=127}  [trial-2384↪4g:srsenb-rftype@zmq+srsue-rftype@zmq↪iperf3_ul.py:42↪iperf3_ul.py↪srsepc_10.42.42.118↪host-jenkins@10.42.42.116↪srsepc(pid=17260)]
01:26:56.532788 run                srsepc(pid=17260): stdout: 
| (launched: 2022-12-13_01:26:54.767703)
| /osmo-gsm-tester-srsepc/srslte/bin/srsepc: error while loading shared libraries: libboost_program_options.so.1.62.0: cannot open shared object file: No such file or directory 
01:26:56.671786 run                srsepc(pid=17260): stderr: 
| (launched: 2022-12-13_01:26:54.814758)
| Connection to 10.42.42.116 closed. 
01:26:56.806317 run                srsepc(pid=17260): stdout: 
| (launched: 2022-12-13_01:26:54.767703)
| /osmo-gsm-tester-srsepc/srslte/bin/srsepc: error while loading shared libraries: libboost_program_options.so.1.62.0: cannot open shared object file: No such file or directory 
01:26:56.941297 run                srsepc(pid=17260): stderr: 
| (launched: 2022-12-13_01:26:54.814758)
| Connection to 10.42.42.116 closed. 
01:26:57.098048 run         rm-remote-dir(pid=17261): Terminating (SIGINT)
01:26:57.282618 run         rm-remote-dir(pid=17261): Terminated: ok {rc=0}
01:26:57.316394 tst                  iperf3_ul.py:42: ERR: Error: srsepc(pid=17260): Process ended prematurely: srsepc(pid=17260) [trial-2384↪4g:srsenb-rftype@zmq+srsue-rftype@zmq↪iperf3_ul.py:42↪iperf3_ul.py↪srsepc_10.42.42.118↪host-jenkins@10.42.42.116↪srsepc(pid=17260)]  [trial-2384↪4g:srsenb-rftype@zmq+srsue-rftype@zmq↪iperf3_ul.py:42]
01:26:57.326745 tst                  iperf3_ul.py:42: Test FAILED (19.0 sec)
01:26:57.440106 run          scp-back-log(pid=17262): Launched
01:26:58.527213 run          scp-back-log(pid=17262): ERR: Terminated: ERROR {rc=1}  [trial-2384↪4g:srsenb-rftype@zmq+srsue-rftype@zmq↪iperf3_ul.py↪iperf3_ul.py↪srsepc_10.42.42.118↪host-jenkins@10.42.42.116↪scp-back-log(pid=17262)]
01:26:58.589917 run          scp-back-log(pid=17262): stdout: 
| (launched: 2022-12-13_01:26:57.368517) 
01:26:58.652745 run          scp-back-log(pid=17262): stderr: 
| (launched: 2022-12-13_01:26:57.388360)
| scp: /osmo-gsm-tester-srsepc/srsepc/srsepc.log: No such file or directory 
01:26:58.706314 tst              srsepc_10.42.42.118: Error('scp-back-log(pid=17262): launch_sync(): local process exited with status 1 [trial-2384↪4g:srsenb-rftype@zmq+srsue-rftype@zmq↪iperf3_ul.py↪iperf3_ul.py↪srsepc_10.42.42.118↪host-jenkins@10.42.42.116↪scp-back-log(pid=17262)]')

Standard Error

Traceback (most recent call last):
  File "/home/jenkins/workspace/osmo-gsm-tester_run-prod/osmo-gsm-tester/src/osmo_gsm_tester/core/test.py", line 76, in run
    self.path)
  File "/home/jenkins/workspace/osmo-gsm-tester_run-prod/osmo-gsm-tester/src/osmo_gsm_tester/core/util.py", line 414, in run_python_file
    spec.loader.exec_module( importlib.util.module_from_spec(spec) )
  File "<frozen importlib._bootstrap_external>", line 728, in exec_module
  File "<frozen importlib._bootstrap>", line 219, in _call_with_frames_removed
  File "/home/jenkins/workspace/osmo-gsm-tester_run-prod/osmo-gsm-tester/sysmocom/suites/4g/iperf3_ul.py", line 42, in <module>
    enb.start(epc)
  File "/home/jenkins/workspace/osmo-gsm-tester_run-prod/osmo-gsm-tester/src/osmo_gsm_tester/obj/enb_srs.py", line 237, in start
    self.configure()
  File "/home/jenkins/workspace/osmo-gsm-tester_run-prod/osmo-gsm-tester/src/osmo_gsm_tester/obj/enb_srs.py", line 423, in configure
    self.rem_host.recreate_remote_dir(self.remote_inst)
  File "/home/jenkins/workspace/osmo-gsm-tester_run-prod/osmo-gsm-tester/src/osmo_gsm_tester/core/remote.py", line 146, in recreate_remote_dir
    self.rm_remote_dir(remote_dir)
  File "/home/jenkins/workspace/osmo-gsm-tester_run-prod/osmo-gsm-tester/src/osmo_gsm_tester/core/remote.py", line 139, in rm_remote_dir
    self.run_remote_sync('rm-remote-dir', ('test', '!', '-d', remote_dir_str, '||', 'rm', '-rf', remote_dir_str))
  File "/home/jenkins/workspace/osmo-gsm-tester_run-prod/osmo-gsm-tester/src/osmo_gsm_tester/core/remote.py", line 134, in run_remote_sync
    proc.launch_sync()
  File "/home/jenkins/workspace/osmo-gsm-tester_run-prod/osmo-gsm-tester/src/osmo_gsm_tester/core/process.py", line 214, in launch_sync
    raise e
  File "/home/jenkins/workspace/osmo-gsm-tester_run-prod/osmo-gsm-tester/src/osmo_gsm_tester/core/process.py", line 211, in launch_sync
    self.wait()
  File "/home/jenkins/workspace/osmo-gsm-tester_run-prod/osmo-gsm-tester/src/osmo_gsm_tester/core/process.py", line 421, in wait
    MainLoop.wait(self.terminated, timeout=timeout)
  File "/home/jenkins/workspace/osmo-gsm-tester_run-prod/osmo-gsm-tester/src/osmo_gsm_tester/core/event_loop.py", line 108, in wait
    if not self.wait_no_raise(condition, condition_args, condition_kwargs, timeout, timestep):
  File "/home/jenkins/workspace/osmo-gsm-tester_run-prod/osmo-gsm-tester/src/osmo_gsm_tester/core/event_loop.py", line 98, in wait_no_raise
    self.poll(may_block=True)
  File "/home/jenkins/workspace/osmo-gsm-tester_run-prod/osmo-gsm-tester/src/osmo_gsm_tester/core/event_loop.py", line 86, in poll
    self.deferred_handling.handle_queue()
  File "/home/jenkins/workspace/osmo-gsm-tester_run-prod/osmo-gsm-tester/src/osmo_gsm_tester/core/event_loop.py", line 33, in handle_queue
    handler(*args, **kwargs)
  File "/home/jenkins/workspace/osmo-gsm-tester_run-prod/osmo-gsm-tester/src/osmo_gsm_tester/testenv.py", line 142, in poll
    raise log_module.Error('Process ended prematurely: %s' % proc.name())
osmo_gsm_tester.core.log.Error: srsepc(pid=17260): Process ended prematurely: srsepc(pid=17260) [trial-2384↪4g:srsenb-rftype@zmq+srsue-rftype@zmq↪iperf3_ul.py:42↪iperf3_ul.py↪srsepc_10.42.42.118↪host-jenkins@10.42.42.116↪srsepc(pid=17260)]