Skip to content

Failed

4g:srsenb-rftype@zmq+srsue-rftype@zmq.ping.py (from 4g_srsenb-rftype@zmq+srsue-rftype@zmq)

Failing for the past 248 builds (Since #2142 )
Took 20 sec.

Stacktrace

srsepc(pid=22973): Process ended prematurely: srsepc(pid=22973) [trial-2389↪4g:srsenb-rftype@zmq+srsue-rftype@zmq↪ping.py:16↪ping.py↪srsepc_10.42.42.118↪host-jenkins@10.42.42.116↪srsepc(pid=22973)]

Standard Output

----------------------------------------------
trial-2389 4g:srsenb-rftype@zmq+srsue-rftype@zmq ping.py
----------------------------------------------
12:50:00.729925 tst 4g:srsenb-rftype@zmq+srsue-rftype@zmq: Using 1 x run_node (candidates: 1)
12:50:00.747584 tst 4g:srsenb-rftype@zmq+srsue-rftype@zmq: Using 1 x enb (candidates: 1)
12:50:00.772580 tst 4g:srsenb-rftype@zmq+srsue-rftype@zmq: Using 1 x modem (candidates: 1)
12:50:00.944614 tst                          ping.py: using MSISDN 8172
12:50:01.067347 run              srsepc_10.42.42.118: Add subscriber {algo_str='mil', imsi='001010123456789', msisdn='8172', subscriber_id=0}
12:50:01.189298 run              srsepc_10.42.42.118: Starting srsepc
12:50:01.982266 run         rm-remote-dir(pid=22602): Launched
12:50:03.196403 run         rm-remote-dir(pid=22602): Terminated: ok {rc=0}
12:50:03.556475 run         mk-remote-dir(pid=22609): Launched
12:50:04.761378 run         mk-remote-dir(pid=22609): Terminated: ok {rc=0}
12:50:05.067540 run    scp-inst-to-remote(pid=22610): Launched
12:50:07.270952 run    scp-inst-to-remote(pid=22610): Terminated: ok {rc=0}
12:50:07.632687 run         rm-remote-dir(pid=22612): Launched
12:50:08.837497 run         rm-remote-dir(pid=22612): Terminated: ok {rc=0}
12:50:09.199080 run         mk-remote-dir(pid=22614): Launched
12:50:10.403828 run         mk-remote-dir(pid=22614): Terminated: ok {rc=0}
12:50:10.709657 run     scp-cfg-to-remote(pid=22615): Launched
12:50:11.911469 run     scp-cfg-to-remote(pid=22615): Terminated: ok {rc=0}
12:50:12.216395 run      scp-db-to-remote(pid=22617): Launched
12:50:13.416523 run      scp-db-to-remote(pid=22617): Terminated: ok {rc=0}
12:50:13.535621 run              srsepc_10.42.42.118: Setting RPATH for srsepc
12:50:13.887202 run              patchelf(pid=22811): Launched
12:50:15.089460 run              patchelf(pid=22811): Terminated: ok {rc=0}
12:50:15.213557 run              srsepc_10.42.42.118: Applying CAP_NET_ADMIN capability to srsepc
12:50:15.563785 run         setcap-netadm(pid=22972): Launched
12:50:16.805952 run         setcap-netadm(pid=22972): Terminated: ok {rc=0}
12:50:17.246050 run                srsepc(pid=22973): Launched
12:50:17.367224 run   srsenb_srsENB-zmq_10.42.42.117: Starting srsENB
12:50:18.594944 run         rm-remote-dir(pid=22974): Launched
12:50:18.799341 run                srsepc(pid=22973): ERR: Terminated: ERROR {rc=127}  [trial-2389↪4g:srsenb-rftype@zmq+srsue-rftype@zmq↪ping.py:16↪ping.py↪srsepc_10.42.42.118↪host-jenkins@10.42.42.116↪srsepc(pid=22973)]
12:50:18.947810 run                srsepc(pid=22973): stdout: 
| (launched: 2022-12-13_12:50:17.028648)
| /osmo-gsm-tester-srsepc/srslte/bin/srsepc: error while loading shared libraries: libboost_program_options.so.1.62.0: cannot open shared object file: No such file or directory 
12:50:19.096394 run                srsepc(pid=22973): stderr: 
| (launched: 2022-12-13_12:50:17.079537)
| Connection to 10.42.42.116 closed. 
12:50:19.240252 run                srsepc(pid=22973): stdout: 
| (launched: 2022-12-13_12:50:17.028648)
| /osmo-gsm-tester-srsepc/srslte/bin/srsepc: error while loading shared libraries: libboost_program_options.so.1.62.0: cannot open shared object file: No such file or directory 
12:50:19.382724 run                srsepc(pid=22973): stderr: 
| (launched: 2022-12-13_12:50:17.079537)
| Connection to 10.42.42.116 closed. 
12:50:19.549348 run         rm-remote-dir(pid=22974): Terminating (SIGINT)
12:50:19.743845 run         rm-remote-dir(pid=22974): Terminated: ok {rc=0}
12:50:19.780102 tst                       ping.py:16: ERR: Error: srsepc(pid=22973): Process ended prematurely: srsepc(pid=22973) [trial-2389↪4g:srsenb-rftype@zmq+srsue-rftype@zmq↪ping.py:16↪ping.py↪srsepc_10.42.42.118↪host-jenkins@10.42.42.116↪srsepc(pid=22973)]  [trial-2389↪4g:srsenb-rftype@zmq+srsue-rftype@zmq↪ping.py:16]
12:50:19.790646 tst                       ping.py:16: Test FAILED (19.0 sec)
12:50:19.911757 run          scp-back-log(pid=22975): Launched
12:50:21.002974 run          scp-back-log(pid=22975): ERR: Terminated: ERROR {rc=1}  [trial-2389↪4g:srsenb-rftype@zmq+srsue-rftype@zmq↪ping.py↪ping.py↪srsepc_10.42.42.118↪host-jenkins@10.42.42.116↪scp-back-log(pid=22975)]
12:50:21.069203 run          scp-back-log(pid=22975): stdout: 
| (launched: 2022-12-13_12:50:19.835232) 
12:50:21.135713 run          scp-back-log(pid=22975): stderr: 
| (launched: 2022-12-13_12:50:19.856111)
| scp: /osmo-gsm-tester-srsepc/srsepc/srsepc.log: No such file or directory 
12:50:21.192079 tst              srsepc_10.42.42.118: Error('scp-back-log(pid=22975): launch_sync(): local process exited with status 1 [trial-2389↪4g:srsenb-rftype@zmq+srsue-rftype@zmq↪ping.py↪ping.py↪srsepc_10.42.42.118↪host-jenkins@10.42.42.116↪scp-back-log(pid=22975)]')

Standard Error

Traceback (most recent call last):
  File "/home/jenkins/workspace/osmo-gsm-tester_run-prod/osmo-gsm-tester/src/osmo_gsm_tester/core/test.py", line 76, in run
    self.path)
  File "/home/jenkins/workspace/osmo-gsm-tester_run-prod/osmo-gsm-tester/src/osmo_gsm_tester/core/util.py", line 414, in run_python_file
    spec.loader.exec_module( importlib.util.module_from_spec(spec) )
  File "<frozen importlib._bootstrap_external>", line 728, in exec_module
  File "<frozen importlib._bootstrap>", line 219, in _call_with_frames_removed
  File "/home/jenkins/workspace/osmo-gsm-tester_run-prod/osmo-gsm-tester/sysmocom/suites/4g/ping.py", line 16, in <module>
    enb.start(epc)
  File "/home/jenkins/workspace/osmo-gsm-tester_run-prod/osmo-gsm-tester/src/osmo_gsm_tester/obj/enb_srs.py", line 237, in start
    self.configure()
  File "/home/jenkins/workspace/osmo-gsm-tester_run-prod/osmo-gsm-tester/src/osmo_gsm_tester/obj/enb_srs.py", line 423, in configure
    self.rem_host.recreate_remote_dir(self.remote_inst)
  File "/home/jenkins/workspace/osmo-gsm-tester_run-prod/osmo-gsm-tester/src/osmo_gsm_tester/core/remote.py", line 146, in recreate_remote_dir
    self.rm_remote_dir(remote_dir)
  File "/home/jenkins/workspace/osmo-gsm-tester_run-prod/osmo-gsm-tester/src/osmo_gsm_tester/core/remote.py", line 139, in rm_remote_dir
    self.run_remote_sync('rm-remote-dir', ('test', '!', '-d', remote_dir_str, '||', 'rm', '-rf', remote_dir_str))
  File "/home/jenkins/workspace/osmo-gsm-tester_run-prod/osmo-gsm-tester/src/osmo_gsm_tester/core/remote.py", line 134, in run_remote_sync
    proc.launch_sync()
  File "/home/jenkins/workspace/osmo-gsm-tester_run-prod/osmo-gsm-tester/src/osmo_gsm_tester/core/process.py", line 214, in launch_sync
    raise e
  File "/home/jenkins/workspace/osmo-gsm-tester_run-prod/osmo-gsm-tester/src/osmo_gsm_tester/core/process.py", line 211, in launch_sync
    self.wait()
  File "/home/jenkins/workspace/osmo-gsm-tester_run-prod/osmo-gsm-tester/src/osmo_gsm_tester/core/process.py", line 421, in wait
    MainLoop.wait(self.terminated, timeout=timeout)
  File "/home/jenkins/workspace/osmo-gsm-tester_run-prod/osmo-gsm-tester/src/osmo_gsm_tester/core/event_loop.py", line 108, in wait
    if not self.wait_no_raise(condition, condition_args, condition_kwargs, timeout, timestep):
  File "/home/jenkins/workspace/osmo-gsm-tester_run-prod/osmo-gsm-tester/src/osmo_gsm_tester/core/event_loop.py", line 98, in wait_no_raise
    self.poll(may_block=True)
  File "/home/jenkins/workspace/osmo-gsm-tester_run-prod/osmo-gsm-tester/src/osmo_gsm_tester/core/event_loop.py", line 86, in poll
    self.deferred_handling.handle_queue()
  File "/home/jenkins/workspace/osmo-gsm-tester_run-prod/osmo-gsm-tester/src/osmo_gsm_tester/core/event_loop.py", line 33, in handle_queue
    handler(*args, **kwargs)
  File "/home/jenkins/workspace/osmo-gsm-tester_run-prod/osmo-gsm-tester/src/osmo_gsm_tester/testenv.py", line 142, in poll
    raise log_module.Error('Process ended prematurely: %s' % proc.name())
osmo_gsm_tester.core.log.Error: srsepc(pid=22973): Process ended prematurely: srsepc(pid=22973) [trial-2389↪4g:srsenb-rftype@zmq+srsue-rftype@zmq↪ping.py:16↪ping.py↪srsepc_10.42.42.118↪host-jenkins@10.42.42.116↪srsepc(pid=22973)]