Skip to content

Failed

4g:srsenb-rftype@zmq+srsue-rftype@zmq.iperf3_bidir.py (from 4g_srsenb-rftype@zmq+srsue-rftype@zmq)

Failing for the past 82 builds (Since #2318 )
Took 19 sec.

Stacktrace

srsepc(pid=10465): Process ended prematurely: srsepc(pid=10465) [trial-2399↪4g:srsenb-rftype@zmq+srsue-rftype@zmq↪iperf3_bidir.py:42↪iperf3_bidir.py↪srsepc_10.42.42.118↪host-jenkins@10.42.42.116↪srsepc(pid=10465)]

Standard Output

----------------------------------------------
trial-2399 4g:srsenb-rftype@zmq+srsue-rftype@zmq iperf3_bidir.py
----------------------------------------------
04:50:22.042646 tst               iperf3_bidir.py:13: Number of physical ue: 1
04:50:22.084783 tst 4g:srsenb-rftype@zmq+srsue-rftype@zmq: Using 1 x modem (candidates: 1)
04:50:22.290922 tst               iperf3_bidir.py:20: ue index0: srsue_10.42.42.116
04:50:22.332662 tst 4g:srsenb-rftype@zmq+srsue-rftype@zmq: Using 1 x run_node (candidates: 1)
04:50:22.348292 tst 4g:srsenb-rftype@zmq+srsue-rftype@zmq: Using 1 x enb (candidates: 1)
04:50:22.469634 tst                  iperf3_bidir.py: using MSISDN 8519
04:50:22.577817 run              srsepc_10.42.42.118: Add subscriber {algo_str='mil', imsi='001010123456789', msisdn='8519', subscriber_id=0}
04:50:22.684466 run              srsepc_10.42.42.118: Starting srsepc
04:50:23.331352 run         rm-remote-dir(pid=10453): Launched
04:50:24.519493 run         rm-remote-dir(pid=10453): Terminated: ok {rc=0}
04:50:24.851152 run         mk-remote-dir(pid=10454): Launched
04:50:26.039282 run         mk-remote-dir(pid=10454): Terminated: ok {rc=0}
04:50:26.320469 run    scp-inst-to-remote(pid=10455): Launched
04:50:28.508664 run    scp-inst-to-remote(pid=10455): Terminated: ok {rc=0}
04:50:28.841742 run         rm-remote-dir(pid=10457): Launched
04:50:30.041766 run         rm-remote-dir(pid=10457): Terminated: ok {rc=0}
04:50:30.396012 run         mk-remote-dir(pid=10458): Launched
04:50:31.600755 run         mk-remote-dir(pid=10458): Terminated: ok {rc=0}
04:50:31.989988 run     scp-cfg-to-remote(pid=10459): Launched
04:50:33.205473 run     scp-cfg-to-remote(pid=10459): Terminated: ok {rc=0}
04:50:33.487098 run      scp-db-to-remote(pid=10461): Launched
04:50:34.672496 run      scp-db-to-remote(pid=10461): Terminated: ok {rc=0}
04:50:34.786557 run              srsepc_10.42.42.118: Setting RPATH for srsepc
04:50:35.108670 run              patchelf(pid=10463): Launched
04:50:36.295599 run              patchelf(pid=10463): Terminated: ok {rc=0}
04:50:36.410168 run              srsepc_10.42.42.118: Applying CAP_NET_ADMIN capability to srsepc
04:50:36.732888 run         setcap-netadm(pid=10464): Launched
04:50:37.919097 run         setcap-netadm(pid=10464): Terminated: ok {rc=0}
04:50:38.234715 run                srsepc(pid=10465): Launched
04:50:38.343856 run   srsenb_srsENB-zmq_10.42.42.117: Starting srsENB
04:50:39.479956 run         rm-remote-dir(pid=10466): Launched
04:50:39.668675 run                srsepc(pid=10465): ERR: Terminated: ERROR {rc=127}  [trial-2399↪4g:srsenb-rftype@zmq+srsue-rftype@zmq↪iperf3_bidir.py:42↪iperf3_bidir.py↪srsepc_10.42.42.118↪host-jenkins@10.42.42.116↪srsepc(pid=10465)]
04:50:39.806447 run                srsepc(pid=10465): stdout: 
| (launched: 2022-12-14_04:50:38.082778)
| /osmo-gsm-tester-srsepc/srslte/bin/srsepc: error while loading shared libraries: libboost_program_options.so.1.62.0: cannot open shared object file: No such file or directory 
04:50:39.942626 run                srsepc(pid=10465): stderr: 
| (launched: 2022-12-14_04:50:38.129112)
| Connection to 10.42.42.116 closed. 
04:50:40.075178 run                srsepc(pid=10465): stdout: 
| (launched: 2022-12-14_04:50:38.082778)
| /osmo-gsm-tester-srsepc/srslte/bin/srsepc: error while loading shared libraries: libboost_program_options.so.1.62.0: cannot open shared object file: No such file or directory 
04:50:40.206517 run                srsepc(pid=10465): stderr: 
| (launched: 2022-12-14_04:50:38.129112)
| Connection to 10.42.42.116 closed. 
04:50:40.359876 run         rm-remote-dir(pid=10466): Terminating (SIGINT)
04:50:40.539467 run         rm-remote-dir(pid=10466): Terminated: ok {rc=0}
04:50:40.572581 tst               iperf3_bidir.py:42: ERR: Error: srsepc(pid=10465): Process ended prematurely: srsepc(pid=10465) [trial-2399↪4g:srsenb-rftype@zmq+srsue-rftype@zmq↪iperf3_bidir.py:42↪iperf3_bidir.py↪srsepc_10.42.42.118↪host-jenkins@10.42.42.116↪srsepc(pid=10465)]  [trial-2399↪4g:srsenb-rftype@zmq+srsue-rftype@zmq↪iperf3_bidir.py:42]
04:50:40.582595 tst               iperf3_bidir.py:42: Test FAILED (18.7 sec)
04:50:40.694608 run          scp-back-log(pid=10467): Launched
04:50:41.781140 run          scp-back-log(pid=10467): ERR: Terminated: ERROR {rc=1}  [trial-2399↪4g:srsenb-rftype@zmq+srsue-rftype@zmq↪iperf3_bidir.py↪iperf3_bidir.py↪srsepc_10.42.42.118↪host-jenkins@10.42.42.116↪scp-back-log(pid=10467)]
04:50:41.843024 run          scp-back-log(pid=10467): stdout: 
| (launched: 2022-12-14_04:50:40.623749) 
04:50:41.906333 run          scp-back-log(pid=10467): stderr: 
| (launched: 2022-12-14_04:50:40.643500)
| scp: /osmo-gsm-tester-srsepc/srsepc/srsepc.log: No such file or directory 
04:50:41.959639 tst              srsepc_10.42.42.118: Error('scp-back-log(pid=10467): launch_sync(): local process exited with status 1 [trial-2399↪4g:srsenb-rftype@zmq+srsue-rftype@zmq↪iperf3_bidir.py↪iperf3_bidir.py↪srsepc_10.42.42.118↪host-jenkins@10.42.42.116↪scp-back-log(pid=10467)]')

Standard Error

Traceback (most recent call last):
  File "/home/jenkins/workspace/osmo-gsm-tester_run-prod/osmo-gsm-tester/src/osmo_gsm_tester/core/test.py", line 76, in run
    self.path)
  File "/home/jenkins/workspace/osmo-gsm-tester_run-prod/osmo-gsm-tester/src/osmo_gsm_tester/core/util.py", line 414, in run_python_file
    spec.loader.exec_module( importlib.util.module_from_spec(spec) )
  File "<frozen importlib._bootstrap_external>", line 728, in exec_module
  File "<frozen importlib._bootstrap>", line 219, in _call_with_frames_removed
  File "/home/jenkins/workspace/osmo-gsm-tester_run-prod/osmo-gsm-tester/sysmocom/suites/4g/iperf3_bidir.py", line 42, in <module>
    enb.start(epc)
  File "/home/jenkins/workspace/osmo-gsm-tester_run-prod/osmo-gsm-tester/src/osmo_gsm_tester/obj/enb_srs.py", line 237, in start
    self.configure()
  File "/home/jenkins/workspace/osmo-gsm-tester_run-prod/osmo-gsm-tester/src/osmo_gsm_tester/obj/enb_srs.py", line 423, in configure
    self.rem_host.recreate_remote_dir(self.remote_inst)
  File "/home/jenkins/workspace/osmo-gsm-tester_run-prod/osmo-gsm-tester/src/osmo_gsm_tester/core/remote.py", line 146, in recreate_remote_dir
    self.rm_remote_dir(remote_dir)
  File "/home/jenkins/workspace/osmo-gsm-tester_run-prod/osmo-gsm-tester/src/osmo_gsm_tester/core/remote.py", line 139, in rm_remote_dir
    self.run_remote_sync('rm-remote-dir', ('test', '!', '-d', remote_dir_str, '||', 'rm', '-rf', remote_dir_str))
  File "/home/jenkins/workspace/osmo-gsm-tester_run-prod/osmo-gsm-tester/src/osmo_gsm_tester/core/remote.py", line 134, in run_remote_sync
    proc.launch_sync()
  File "/home/jenkins/workspace/osmo-gsm-tester_run-prod/osmo-gsm-tester/src/osmo_gsm_tester/core/process.py", line 214, in launch_sync
    raise e
  File "/home/jenkins/workspace/osmo-gsm-tester_run-prod/osmo-gsm-tester/src/osmo_gsm_tester/core/process.py", line 211, in launch_sync
    self.wait()
  File "/home/jenkins/workspace/osmo-gsm-tester_run-prod/osmo-gsm-tester/src/osmo_gsm_tester/core/process.py", line 421, in wait
    MainLoop.wait(self.terminated, timeout=timeout)
  File "/home/jenkins/workspace/osmo-gsm-tester_run-prod/osmo-gsm-tester/src/osmo_gsm_tester/core/event_loop.py", line 108, in wait
    if not self.wait_no_raise(condition, condition_args, condition_kwargs, timeout, timestep):
  File "/home/jenkins/workspace/osmo-gsm-tester_run-prod/osmo-gsm-tester/src/osmo_gsm_tester/core/event_loop.py", line 98, in wait_no_raise
    self.poll(may_block=True)
  File "/home/jenkins/workspace/osmo-gsm-tester_run-prod/osmo-gsm-tester/src/osmo_gsm_tester/core/event_loop.py", line 86, in poll
    self.deferred_handling.handle_queue()
  File "/home/jenkins/workspace/osmo-gsm-tester_run-prod/osmo-gsm-tester/src/osmo_gsm_tester/core/event_loop.py", line 33, in handle_queue
    handler(*args, **kwargs)
  File "/home/jenkins/workspace/osmo-gsm-tester_run-prod/osmo-gsm-tester/src/osmo_gsm_tester/testenv.py", line 142, in poll
    raise log_module.Error('Process ended prematurely: %s' % proc.name())
osmo_gsm_tester.core.log.Error: srsepc(pid=10465): Process ended prematurely: srsepc(pid=10465) [trial-2399↪4g:srsenb-rftype@zmq+srsue-rftype@zmq↪iperf3_bidir.py:42↪iperf3_bidir.py↪srsepc_10.42.42.118↪host-jenkins@10.42.42.116↪srsepc(pid=10465)]