Skip to content

Failed

4g:srsenb-rftype@zmq+srsue-rftype@zmq.handover.py (from 4g_srsenb-rftype@zmq+srsue-rftype@zmq)

Failing for the past 263 builds (Since #2139 )
Took 21 sec.

Stacktrace

srsepc(pid=27222): Process ended prematurely: srsepc(pid=27222) [trial-2401↪4g:srsenb-rftype@zmq+srsue-rftype@zmq↪handover.py:37↪handover.py↪srsepc_10.42.42.118↪host-jenkins@10.42.42.116↪srsepc(pid=27222)]

Standard Output

----------------------------------------------
trial-2401 4g:srsenb-rftype@zmq+srsue-rftype@zmq handover.py
----------------------------------------------
08:12:46.332749 tst                   handover.py:11: TEST_CONFIG:
{}
08:12:46.380495 tst 4g:srsenb-rftype@zmq+srsue-rftype@zmq: Using 1 x run_node (candidates: 1)
08:12:46.397908 tst 4g:srsenb-rftype@zmq+srsue-rftype@zmq: Using 1 x enb (candidates: 1)
08:12:46.423360 tst 4g:srsenb-rftype@zmq+srsue-rftype@zmq: Using 1 x modem (candidates: 1)
08:12:46.605268 tst                      handover.py: using MSISDN 8588
08:12:46.729955 run              srsepc_10.42.42.118: Add subscriber {algo_str='mil', imsi='001010123456789', msisdn='8588', subscriber_id=0}
08:12:46.844354 run              srsepc_10.42.42.118: Starting srsepc
08:12:48.818936 run         rm-remote-dir(pid=27210): Launched
08:12:49.019913 bus                        /sierra_2: Setting Powered False
08:12:50.043002 run         rm-remote-dir(pid=27210): Terminated: ok {rc=0}
08:12:50.477666 run         mk-remote-dir(pid=27211): Launched
08:12:51.667688 run         mk-remote-dir(pid=27211): Terminated: ok {rc=0}
08:12:51.953682 run    scp-inst-to-remote(pid=27212): Launched
08:12:54.153756 run    scp-inst-to-remote(pid=27212): Terminated: ok {rc=0}
08:12:54.509858 run         rm-remote-dir(pid=27214): Launched
08:12:55.712844 run         rm-remote-dir(pid=27214): Terminated: ok {rc=0}
08:12:56.068766 run         mk-remote-dir(pid=27215): Launched
08:12:57.272311 run         mk-remote-dir(pid=27215): Terminated: ok {rc=0}
08:12:57.573796 run     scp-cfg-to-remote(pid=27216): Launched
08:12:58.761768 run     scp-cfg-to-remote(pid=27216): Terminated: ok {rc=0}
08:12:59.044024 run      scp-db-to-remote(pid=27218): Launched
08:13:00.232114 run      scp-db-to-remote(pid=27218): Terminated: ok {rc=0}
08:13:00.347190 run              srsepc_10.42.42.118: Setting RPATH for srsepc
08:13:00.673232 run              patchelf(pid=27220): Launched
08:13:01.870255 run              patchelf(pid=27220): Terminated: ok {rc=0}
08:13:01.988309 run              srsepc_10.42.42.118: Applying CAP_NET_ADMIN capability to srsepc
08:13:02.328101 run         setcap-netadm(pid=27221): Launched
08:13:03.528286 run         setcap-netadm(pid=27221): Terminated: ok {rc=0}
08:13:03.866078 run                srsepc(pid=27222): Launched
08:13:03.984474 run   srsenb_srsENB-zmq_10.42.42.117: Starting srsENB
08:13:05.200519 run         rm-remote-dir(pid=27223): Launched
08:13:05.402623 run                srsepc(pid=27222): ERR: Terminated: ERROR {rc=127}  [trial-2401↪4g:srsenb-rftype@zmq+srsue-rftype@zmq↪handover.py:37↪handover.py↪srsepc_10.42.42.118↪host-jenkins@10.42.42.116↪srsepc(pid=27222)]
08:13:05.549088 run                srsepc(pid=27222): stdout: 
| (launched: 2022-12-14_08:13:03.705208)
| /osmo-gsm-tester-srsepc/srslte/bin/srsepc: error while loading shared libraries: libboost_program_options.so.1.62.0: cannot open shared object file: No such file or directory 
08:13:05.695691 run                srsepc(pid=27222): stderr: 
| (launched: 2022-12-14_08:13:03.754846)
| Connection to 10.42.42.116 closed. 
08:13:05.838643 run                srsepc(pid=27222): stdout: 
| (launched: 2022-12-14_08:13:03.705208)
| /osmo-gsm-tester-srsepc/srslte/bin/srsepc: error while loading shared libraries: libboost_program_options.so.1.62.0: cannot open shared object file: No such file or directory 
08:13:05.979899 run                srsepc(pid=27222): stderr: 
| (launched: 2022-12-14_08:13:03.754846)
| Connection to 10.42.42.116 closed. 
08:13:06.146403 run         rm-remote-dir(pid=27223): Terminating (SIGINT)
08:13:06.341553 run         rm-remote-dir(pid=27223): Terminated: ok {rc=0}
08:13:06.377016 tst                   handover.py:37: ERR: Error: srsepc(pid=27222): Process ended prematurely: srsepc(pid=27222) [trial-2401↪4g:srsenb-rftype@zmq+srsue-rftype@zmq↪handover.py:37↪handover.py↪srsepc_10.42.42.118↪host-jenkins@10.42.42.116↪srsepc(pid=27222)]  [trial-2401↪4g:srsenb-rftype@zmq+srsue-rftype@zmq↪handover.py:37]
08:13:06.387311 tst                   handover.py:37: Test FAILED (20.2 sec)
08:13:06.506636 run          scp-back-log(pid=27224): Launched
08:13:07.597462 run          scp-back-log(pid=27224): ERR: Terminated: ERROR {rc=1}  [trial-2401↪4g:srsenb-rftype@zmq+srsue-rftype@zmq↪handover.py↪handover.py↪srsepc_10.42.42.118↪host-jenkins@10.42.42.116↪scp-back-log(pid=27224)]
08:13:07.663688 run          scp-back-log(pid=27224): stdout: 
| (launched: 2022-12-14_08:13:06.431193) 
08:13:07.729817 run          scp-back-log(pid=27224): stderr: 
| (launched: 2022-12-14_08:13:06.451902)
| scp: /osmo-gsm-tester-srsepc/srsepc/srsepc.log: No such file or directory 
08:13:07.786222 tst              srsepc_10.42.42.118: Error('scp-back-log(pid=27224): launch_sync(): local process exited with status 1 [trial-2401↪4g:srsenb-rftype@zmq+srsue-rftype@zmq↪handover.py↪handover.py↪srsepc_10.42.42.118↪host-jenkins@10.42.42.116↪scp-back-log(pid=27224)]')

Standard Error

Traceback (most recent call last):
  File "/home/jenkins/workspace/osmo-gsm-tester_run-prod/osmo-gsm-tester/src/osmo_gsm_tester/core/test.py", line 76, in run
    self.path)
  File "/home/jenkins/workspace/osmo-gsm-tester_run-prod/osmo-gsm-tester/src/osmo_gsm_tester/core/util.py", line 414, in run_python_file
    spec.loader.exec_module( importlib.util.module_from_spec(spec) )
  File "<frozen importlib._bootstrap_external>", line 728, in exec_module
  File "<frozen importlib._bootstrap>", line 219, in _call_with_frames_removed
  File "/home/jenkins/workspace/osmo-gsm-tester_run-prod/osmo-gsm-tester/sysmocom/suites/4g/handover.py", line 37, in <module>
    enb.start(epc)
  File "/home/jenkins/workspace/osmo-gsm-tester_run-prod/osmo-gsm-tester/src/osmo_gsm_tester/obj/enb_srs.py", line 237, in start
    self.configure()
  File "/home/jenkins/workspace/osmo-gsm-tester_run-prod/osmo-gsm-tester/src/osmo_gsm_tester/obj/enb_srs.py", line 423, in configure
    self.rem_host.recreate_remote_dir(self.remote_inst)
  File "/home/jenkins/workspace/osmo-gsm-tester_run-prod/osmo-gsm-tester/src/osmo_gsm_tester/core/remote.py", line 146, in recreate_remote_dir
    self.rm_remote_dir(remote_dir)
  File "/home/jenkins/workspace/osmo-gsm-tester_run-prod/osmo-gsm-tester/src/osmo_gsm_tester/core/remote.py", line 139, in rm_remote_dir
    self.run_remote_sync('rm-remote-dir', ('test', '!', '-d', remote_dir_str, '||', 'rm', '-rf', remote_dir_str))
  File "/home/jenkins/workspace/osmo-gsm-tester_run-prod/osmo-gsm-tester/src/osmo_gsm_tester/core/remote.py", line 134, in run_remote_sync
    proc.launch_sync()
  File "/home/jenkins/workspace/osmo-gsm-tester_run-prod/osmo-gsm-tester/src/osmo_gsm_tester/core/process.py", line 214, in launch_sync
    raise e
  File "/home/jenkins/workspace/osmo-gsm-tester_run-prod/osmo-gsm-tester/src/osmo_gsm_tester/core/process.py", line 211, in launch_sync
    self.wait()
  File "/home/jenkins/workspace/osmo-gsm-tester_run-prod/osmo-gsm-tester/src/osmo_gsm_tester/core/process.py", line 421, in wait
    MainLoop.wait(self.terminated, timeout=timeout)
  File "/home/jenkins/workspace/osmo-gsm-tester_run-prod/osmo-gsm-tester/src/osmo_gsm_tester/core/event_loop.py", line 108, in wait
    if not self.wait_no_raise(condition, condition_args, condition_kwargs, timeout, timestep):
  File "/home/jenkins/workspace/osmo-gsm-tester_run-prod/osmo-gsm-tester/src/osmo_gsm_tester/core/event_loop.py", line 98, in wait_no_raise
    self.poll(may_block=True)
  File "/home/jenkins/workspace/osmo-gsm-tester_run-prod/osmo-gsm-tester/src/osmo_gsm_tester/core/event_loop.py", line 86, in poll
    self.deferred_handling.handle_queue()
  File "/home/jenkins/workspace/osmo-gsm-tester_run-prod/osmo-gsm-tester/src/osmo_gsm_tester/core/event_loop.py", line 33, in handle_queue
    handler(*args, **kwargs)
  File "/home/jenkins/workspace/osmo-gsm-tester_run-prod/osmo-gsm-tester/src/osmo_gsm_tester/testenv.py", line 142, in poll
    raise log_module.Error('Process ended prematurely: %s' % proc.name())
osmo_gsm_tester.core.log.Error: srsepc(pid=27222): Process ended prematurely: srsepc(pid=27222) [trial-2401↪4g:srsenb-rftype@zmq+srsue-rftype@zmq↪handover.py:37↪handover.py↪srsepc_10.42.42.118↪host-jenkins@10.42.42.116↪srsepc(pid=27222)]