Skip to content
Failed

Console Output

Skipping 35 KB.. Full Log
#6 10.03 Get:101 http://deb.debian.org/debian buster/main amd64 libtinyxml2-6a amd64 7.0.0+dfsg-1 [29.3 kB]
#6 10.03 Get:102 http://deb.debian.org/debian buster/main amd64 python3-pygments all 2.3.1+dfsg-1+deb10u2 [594 kB]
#6 10.03 Get:103 http://deb.debian.org/debian buster/main amd64 cppcheck amd64 1.86-1 [1067 kB]
#6 10.04 Get:104 http://deb.debian.org/debian buster/main amd64 libtool all 2.4.6-9 [547 kB]
#6 10.04 Get:105 http://deb.debian.org/debian buster/main amd64 dh-autoreconf all 19 [16.9 kB]
#6 10.04 Get:106 http://deb.debian.org/debian buster/main amd64 libarchive-zip-perl all 1.64-1 [96.8 kB]
#6 10.05 Get:107 http://deb.debian.org/debian buster/main amd64 libfile-stripnondeterminism-perl all 1.1.2-1 [19.8 kB]
#6 10.05 Get:108 http://deb.debian.org/debian buster/main amd64 dh-strip-nondeterminism all 1.1.2-1 [13.0 kB]
#6 10.05 Get:109 http://deb.debian.org/debian buster/main amd64 dwz amd64 0.12-3 [78.0 kB]
#6 10.05 Get:110 http://deb.debian.org/debian-security buster/updates/main amd64 libglib2.0-0 amd64 2.58.3-2+deb10u6 [1263 kB]
#6 10.06 Get:111 http://deb.debian.org/debian buster/main amd64 libcroco3 amd64 0.6.12-3 [145 kB]
#6 10.06 Get:112 http://deb.debian.org/debian buster/main amd64 gettext amd64 0.19.8.1-9 [1303 kB]
#6 10.07 Get:113 http://deb.debian.org/debian buster/main amd64 intltool-debian all 0.35.0+20060710.5 [26.8 kB]
#6 10.07 Get:114 http://deb.debian.org/debian buster/main amd64 po-debconf all 1.0.21 [248 kB]
#6 10.07 Get:115 http://deb.debian.org/debian buster/main amd64 debhelper all 12.1.1 [1016 kB]
#6 10.08 Get:116 http://deb.debian.org/debian buster/main amd64 libtext-charwidth-perl amd64 0.04-7.1+b1 [10.0 kB]
#6 10.08 Get:117 http://deb.debian.org/debian buster/main amd64 libtext-wrapi18n-perl all 0.06-7.1 [8644 B]
#6 10.08 Get:118 http://deb.debian.org/debian buster/main amd64 module-assistant all 0.11.10 [101 kB]
#6 10.08 Get:119 http://deb.debian.org/debian buster/main amd64 dahdi-source all 1:2.11.1.0.20170917~dfsg-7 [905 kB]
#6 10.09 Get:120 http://deb.debian.org/debian buster/main amd64 libfakeroot amd64 1.23-1 [45.9 kB]
#6 10.09 Get:121 http://deb.debian.org/debian buster/main amd64 fakeroot amd64 1.23-1 [85.8 kB]
#6 10.09 Get:122 http://deb.debian.org/debian buster/main amd64 libassuan0 amd64 2.5.2-1 [49.4 kB]
#6 10.09 Get:123 http://deb.debian.org/debian buster/main amd64 gpgconf amd64 2.2.12-1+deb10u2 [510 kB]
#6 10.10 Get:124 http://deb.debian.org/debian buster/main amd64 lsb-base all 10.2019051400 [28.4 kB]
#6 10.10 Get:125 http://deb.debian.org/debian-security buster/updates/main amd64 libksba8 amd64 1.3.5-2+deb10u2 [102 kB]
#6 10.10 Get:126 http://deb.debian.org/debian buster/main amd64 libsasl2-modules-db amd64 2.1.27+dfsg-1+deb10u2 [69.2 kB]
#6 10.10 Get:127 http://deb.debian.org/debian buster/main amd64 libsasl2-2 amd64 2.1.27+dfsg-1+deb10u2 [106 kB]
#6 10.10 Get:128 http://deb.debian.org/debian buster/main amd64 libldap-common all 2.4.47+dfsg-3+deb10u7 [90.1 kB]
#6 10.10 Get:129 http://deb.debian.org/debian buster/main amd64 libldap-2.4-2 amd64 2.4.47+dfsg-3+deb10u7 [224 kB]
#6 10.10 Get:130 http://deb.debian.org/debian buster/main amd64 libnpth0 amd64 1.6-1 [18.4 kB]
#6 10.10 Get:131 http://deb.debian.org/debian buster/main amd64 dirmngr amd64 2.2.12-1+deb10u2 [712 kB]
#6 10.11 Get:132 http://deb.debian.org/debian buster/main amd64 gnupg-l10n all 2.2.12-1+deb10u2 [1009 kB]
#6 10.12 Get:133 http://deb.debian.org/debian buster/main amd64 gnupg-utils amd64 2.2.12-1+deb10u2 [861 kB]
#6 10.13 Get:134 http://deb.debian.org/debian buster/main amd64 gpg amd64 2.2.12-1+deb10u2 [865 kB]
#6 10.13 Get:135 http://deb.debian.org/debian buster/main amd64 pinentry-curses amd64 1.1.0-2 [64.5 kB]
#6 10.13 Get:136 http://deb.debian.org/debian buster/main amd64 gpg-agent amd64 2.2.12-1+deb10u2 [617 kB]
#6 10.14 Get:137 http://deb.debian.org/debian buster/main amd64 gpg-wks-client amd64 2.2.12-1+deb10u2 [485 kB]
#6 10.14 Get:138 http://deb.debian.org/debian buster/main amd64 gpg-wks-server amd64 2.2.12-1+deb10u2 [478 kB]
#6 10.15 Get:139 http://deb.debian.org/debian buster/main amd64 gpgsm amd64 2.2.12-1+deb10u2 [604 kB]
#6 10.15 Get:140 http://deb.debian.org/debian buster/main amd64 gnupg all 2.2.12-1+deb10u2 [715 kB]
#6 10.16 Get:141 http://deb.debian.org/debian buster/main amd64 libfile-which-perl all 1.23-1 [16.6 kB]
#6 10.16 Get:142 http://deb.debian.org/debian buster/main amd64 libfile-homedir-perl all 1.004-1 [42.7 kB]
#6 10.16 Get:143 http://deb.debian.org/debian buster/main amd64 libio-pty-perl amd64 1:1.08-1.1+b5 [33.7 kB]
#6 10.16 Get:144 http://deb.debian.org/debian buster/main amd64 libipc-run-perl all 20180523.0-1 [101 kB]
#6 10.16 Get:145 http://deb.debian.org/debian buster/main amd64 libclass-method-modifiers-perl all 2.12-1 [18.6 kB]
#6 10.16 Get:146 http://deb.debian.org/debian buster/main amd64 libsub-exporter-progressive-perl all 0.001013-1 [7588 B]
#6 10.16 Get:147 http://deb.debian.org/debian buster/main amd64 libdevel-globaldestruction-perl all 0.14-1 [8084 B]
#6 10.16 Get:148 http://deb.debian.org/debian buster/main amd64 libb-hooks-op-check-perl amd64 0.22-1+b1 [11.4 kB]
#6 10.16 Get:149 http://deb.debian.org/debian buster/main amd64 libdynaloader-functions-perl all 0.003-1 [12.6 kB]
#6 10.17 Get:150 http://deb.debian.org/debian buster/main amd64 libdevel-callchecker-perl amd64 0.008-1 [15.7 kB]
#6 10.17 Get:151 http://deb.debian.org/debian buster/main amd64 libparams-classify-perl amd64 0.015-1+b1 [25.5 kB]
#6 10.17 Get:152 http://deb.debian.org/debian buster/main amd64 libmodule-runtime-perl all 0.016-1 [19.4 kB]
#6 10.17 Get:153 http://deb.debian.org/debian buster/main amd64 libimport-into-perl all 1.002005-1 [11.6 kB]
#6 10.17 Get:154 http://deb.debian.org/debian buster/main amd64 librole-tiny-perl all 2.000006-1 [19.4 kB]
#6 10.17 Get:155 http://deb.debian.org/debian buster/main amd64 libstrictures-perl all 2.000005-1 [18.3 kB]
#6 10.17 Get:156 http://deb.debian.org/debian buster/main amd64 libsub-quote-perl all 2.005001-1 [17.9 kB]
#6 10.17 Get:157 http://deb.debian.org/debian buster/main amd64 libmoo-perl all 2.003004-2 [57.4 kB]
#6 10.17 Get:158 http://deb.debian.org/debian buster/main amd64 libencode-locale-perl all 1.05-1 [13.7 kB]
#6 10.17 Get:159 http://deb.debian.org/debian buster/main amd64 libtimedate-perl all 2.3000-2+deb10u1 [38.1 kB]
#6 10.18 Get:160 http://deb.debian.org/debian buster/main amd64 libhttp-date-perl all 6.02-1 [10.7 kB]
#6 10.18 Get:161 http://deb.debian.org/debian buster/main amd64 libfile-listing-perl all 6.04-1 [10.3 kB]
#6 10.18 Get:162 http://deb.debian.org/debian buster/main amd64 libhtml-tagset-perl all 3.20-3 [12.7 kB]
#6 10.18 Get:163 http://deb.debian.org/debian buster/main amd64 liburi-perl all 1.76-1 [89.9 kB]
#6 10.18 Get:164 http://deb.debian.org/debian buster/main amd64 libhtml-parser-perl amd64 3.72-3+b3 [105 kB]
#6 10.18 Get:165 http://deb.debian.org/debian buster/main amd64 libhtml-tree-perl all 5.07-2 [213 kB]
#6 10.18 Get:166 http://deb.debian.org/debian buster/main amd64 libio-html-perl all 1.001-1 [17.6 kB]
#6 10.18 Get:167 http://deb.debian.org/debian buster/main amd64 liblwp-mediatypes-perl all 6.02-1 [22.1 kB]
#6 10.18 Get:168 http://deb.debian.org/debian buster/main amd64 libhttp-message-perl all 6.18-1 [77.8 kB]
#6 10.18 Get:169 http://deb.debian.org/debian buster/main amd64 libhttp-cookies-perl all 6.04-1 [17.8 kB]
#6 10.19 Get:170 http://deb.debian.org/debian buster/main amd64 libhttp-negotiate-perl all 6.01-1 [12.8 kB]
#6 10.19 Get:171 http://deb.debian.org/debian buster/main amd64 perl-openssl-defaults amd64 3 [6782 B]
#6 10.19 Get:172 http://deb.debian.org/debian buster/main amd64 libnet-ssleay-perl amd64 1.85-2+deb10u1 [308 kB]
#6 10.19 Get:173 http://deb.debian.org/debian buster/main amd64 libio-socket-ssl-perl all 2.060-3 [207 kB]
#6 10.19 Get:174 http://deb.debian.org/debian buster/main amd64 libnet-http-perl all 6.18-1 [24.5 kB]
#6 10.19 Get:175 http://deb.debian.org/debian buster/main amd64 liblwp-protocol-https-perl all 6.07-2 [9242 B]
#6 10.19 Get:176 http://deb.debian.org/debian buster/main amd64 libtry-tiny-perl all 0.30-1 [23.3 kB]
#6 10.19 Get:177 http://deb.debian.org/debian buster/main amd64 libwww-robotrules-perl all 6.02-1 [12.9 kB]
#6 10.19 Get:178 http://deb.debian.org/debian buster/main amd64 libwww-perl all 6.36-2 [188 kB]
#6 10.19 Get:179 http://deb.debian.org/debian buster/main amd64 patchutils amd64 0.3.4-2 [90.4 kB]
#6 10.20 Get:180 http://deb.debian.org/debian buster/main amd64 wdiff amd64 1.2.2-2+b1 [122 kB]
#6 10.20 Get:181 http://deb.debian.org/debian buster/main amd64 devscripts amd64 2.19.5+deb10u1 [1046 kB]
#6 10.21 Get:182 http://deb.debian.org/debian buster/main amd64 dh-systemd all 12.1.1 [122 kB]
#6 10.21 Get:183 http://deb.debian.org/debian buster/main amd64 libedit2 amd64 3.1-20181209-1 [94.0 kB]
#6 10.21 Get:184 http://deb.debian.org/debian buster/main amd64 libllvm6.0 amd64 1:6.0.1-10 [14.7 MB]
#6 10.34 Get:185 http://deb.debian.org/debian buster/main amd64 libclang1-6.0 amd64 1:6.0.1-10 [6951 kB]
#6 10.43 Get:186 http://deb.debian.org/debian buster/main amd64 doxygen amd64 1.8.13-10 [3985 kB]
#6 10.48 Get:187 http://deb.debian.org/debian buster/main amd64 equivs all 2.2.0 [22.4 kB]
#6 10.48 Get:188 http://deb.debian.org/debian buster/main amd64 gcc-arm-none-eabi amd64 15:7-2018-q2-6 [28.4 MB]
#6 10.84 Get:189 http://deb.debian.org/debian-security buster/updates/main amd64 libnghttp2-14 amd64 1.36.0-2+deb10u3 [86.1 kB]
#6 10.84 Get:190 http://deb.debian.org/debian buster/main amd64 librtmp1 amd64 2.4+20151223.gitfa8646d.1-2 [60.5 kB]
#6 10.85 Get:191 http://deb.debian.org/debian-security buster/updates/main amd64 libssh2-1 amd64 1.8.0-2.1+deb10u1 [141 kB]
#6 10.85 Get:192 http://deb.debian.org/debian-security buster/updates/main amd64 libcurl3-gnutls amd64 7.64.0-4+deb10u9 [333 kB]
#6 10.85 Get:193 http://deb.debian.org/debian buster/main amd64 liberror-perl all 0.17027-2 [30.9 kB]
#6 10.85 Get:194 http://deb.debian.org/debian-security buster/updates/main amd64 git-man all 1:2.20.1-2+deb10u9 [1624 kB]
#6 10.87 Get:195 http://deb.debian.org/debian-security buster/updates/main amd64 git amd64 1:2.20.1-2+deb10u9 [5667 kB]
#6 10.95 Get:196 http://deb.debian.org/debian buster/main amd64 python3-six all 1.12.0-1 [15.7 kB]
#6 10.95 Get:197 http://deb.debian.org/debian buster/main amd64 python3-dateutil all 2.7.3-3 [64.5 kB]
#6 10.95 Get:198 http://deb.debian.org/debian buster/main amd64 python3-pkg-resources all 40.8.0-1 [153 kB]
#6 10.96 Get:199 http://deb.debian.org/debian buster/main amd64 git-buildpackage all 0.9.14 [978 kB]
#6 10.96 Get:200 http://deb.debian.org/debian-security buster/updates/main amd64 libmbedcrypto3 amd64 2.16.9-0~deb10u1 [220 kB]
#6 10.96 Get:201 http://deb.debian.org/debian-security buster/updates/main amd64 libmbedx509-0 amd64 2.16.9-0~deb10u1 [109 kB]
#6 10.96 Get:202 http://deb.debian.org/debian-security buster/updates/main amd64 libmbedtls12 amd64 2.16.9-0~deb10u1 [140 kB]
#6 10.96 Get:203 http://deb.debian.org/debian buster/main amd64 libbctoolbox1 amd64 0.6.0-2+b2 [48.6 kB]
#6 10.96 Get:204 http://deb.debian.org/debian buster/main amd64 libbctoolbox-dev amd64 0.6.0-2+b2 [71.0 kB]
#6 10.96 Get:205 http://deb.debian.org/debian-security buster/updates/main amd64 libbluetooth3 amd64 5.50-1.2~deb10u5 [102 kB]
#6 10.96 Get:206 http://deb.debian.org/debian buster/main amd64 libdbi1 amd64 0.9.0-5 [31.9 kB]
#6 10.96 Get:207 http://deb.debian.org/debian buster/main amd64 libdbd-sqlite3 amd64 0.9.0-6+b1 [180 kB]
#6 10.97 Get:208 http://deb.debian.org/debian buster/main amd64 libdbi-dev amd64 0.9.0-5 [35.3 kB]
#6 10.97 Get:209 http://deb.debian.org/debian-security buster/updates/main amd64 libdbus-1-3 amd64 1.12.28-0+deb10u1 [219 kB]
#6 10.97 Get:210 http://deb.debian.org/debian buster/main amd64 libevent-2.1-6 amd64 2.1.8-stable-4 [177 kB]
#6 10.97 Get:211 http://deb.debian.org/debian buster/main amd64 libffi-dev amd64 3.2.1-9 [156 kB]
#6 10.97 Get:212 http://deb.debian.org/debian buster/main amd64 libfftw3-double3 amd64 3.3.8-2 [733 kB]
#6 10.98 Get:213 http://deb.debian.org/debian buster/main amd64 libfftw3-long3 amd64 3.3.8-2 [319 kB]
#6 10.99 Get:214 http://deb.debian.org/debian buster/main amd64 libfftw3-quad3 amd64 3.3.8-2 [558 kB]
#6 10.99 Get:215 http://deb.debian.org/debian buster/main amd64 libfftw3-single3 amd64 3.3.8-2 [762 kB]
#6 11.00 Get:216 http://deb.debian.org/debian buster/main amd64 libfftw3-bin amd64 3.3.8-2 [50.7 kB]
#6 11.00 Get:217 http://deb.debian.org/debian buster/main amd64 libfftw3-dev amd64 3.3.8-2 [2106 kB]
#6 11.04 Get:218 http://deb.debian.org/debian-security buster/updates/main amd64 libglib2.0-data all 2.58.3-2+deb10u6 [1112 kB]
#6 11.05 Get:219 http://deb.debian.org/debian-security buster/updates/main amd64 libglib2.0-bin amd64 2.58.3-2+deb10u6 [126 kB]
#6 11.05 Get:220 http://deb.debian.org/debian buster/main amd64 python3-lib2to3 all 3.7.3-1 [76.7 kB]
#6 11.05 Get:221 http://deb.debian.org/debian buster/main amd64 python3-distutils all 3.7.3-1 [142 kB]
#6 11.06 Get:222 http://deb.debian.org/debian-security buster/updates/main amd64 libglib2.0-dev-bin amd64 2.58.3-2+deb10u6 [158 kB]
#6 11.06 Get:223 http://deb.debian.org/debian-security buster/updates/main amd64 uuid-dev amd64 2.33.1-0.1+deb10u1 [93.8 kB]
#6 11.06 Get:224 http://deb.debian.org/debian-security buster/updates/main amd64 libblkid-dev amd64 2.33.1-0.1+deb10u1 [225 kB]
#6 11.06 Get:225 http://deb.debian.org/debian-security buster/updates/main amd64 libmount-dev amd64 2.33.1-0.1+deb10u1 [233 kB]
#6 11.07 Get:226 http://deb.debian.org/debian buster/main amd64 libpcre16-3 amd64 2:8.39-12 [259 kB]
#6 11.07 Get:227 http://deb.debian.org/debian buster/main amd64 libpcre32-3 amd64 2:8.39-12 [250 kB]
#6 11.07 Get:228 http://deb.debian.org/debian buster/main amd64 libpcrecpp0v5 amd64 2:8.39-12 [152 kB]
#6 11.08 Get:229 http://deb.debian.org/debian buster/main amd64 libpcre3-dev amd64 2:8.39-12 [650 kB]
#6 11.09 Get:230 http://deb.debian.org/debian buster/main amd64 libsepol1-dev amd64 2.8-1 [338 kB]
#6 11.10 Get:231 http://deb.debian.org/debian buster/main amd64 libselinux1-dev amd64 2.8-1+b1 [169 kB]
#6 11.10 Get:232 http://deb.debian.org/debian buster/main amd64 pkg-config amd64 0.29-6 [63.5 kB]
#6 11.10 Get:233 http://deb.debian.org/debian-security buster/updates/main amd64 zlib1g-dev amd64 1:1.2.11.dfsg-1+deb10u2 [210 kB]
#6 11.11 Get:234 http://deb.debian.org/debian-security buster/updates/main amd64 libglib2.0-dev amd64 2.58.3-2+deb10u6 [1489 kB]
#6 ...

#5 [1/6] FROM registry.osmocom.org/debian:buster@sha256:2a0c1b9175adf759420fe0fbd7f5b449038319171eb76554bb76cbe172b62b42
#5 DONE 0.1s

#7 [6/6] ADD	HTTPS://DOWNLOADS.OSMOCOM.ORG/PACKAGES/OSMOCOM:/NIGHTLY/DEBIAN_10//RELEASE /tmp/Release
#7 DONE 0.3s

#6 [2/6] RUN	APT-GET update && 	apt-get upgrade -y && 	apt-get install -y --no-install-recommends 		autoconf 		autoconf-archive 		autogen 		automake 		bison 		build-essential 		ca-certificates 		cppcheck 		dahdi-source 		debhelper 		devscripts 		dh-autoreconf 		dh-systemd 		doxygen 		equivs 		flex 		g++ 		gawk 		gcc 		gcc-arm-none-eabi 		git 		git-buildpackage 		gnupg 		libc-ares-dev 		libdbd-sqlite3 		libdbi-dev 		libfftw3-dev 		libgnutls28-dev 		libgps-dev 		libgsm1-dev 		libncurses5-dev 		libnewlib-arm-none-eabi 		libortp-dev 		libpcap-dev 		libpcsclite-dev 		libreadline-dev 		libsctp-dev 		libsofia-sip-ua-glib-dev 		libsqlite3-dev 		libssl-dev 		libtalloc-dev 		libtool 		libusb-1.0-0-dev 		libusb-dev 		make 		netcat-openbsd 		pkg-config 		sqlite3 		stow 		telnet 		tcpdump 		wget && 	apt-get clean
#6 11.14 Get:235 http://deb.debian.org/debian buster/main amd64 libgmpxx4ldbl amd64 2:6.1.2+dfsg-4+deb10u1 [23.0 kB]
#6 11.14 Get:236 http://deb.debian.org/debian buster/main amd64 libgmp-dev amd64 2:6.1.2+dfsg-4+deb10u1 [629 kB]
#6 11.15 Get:237 http://deb.debian.org/debian-security buster/updates/main amd64 libunbound8 amd64 1.9.0-2+deb10u4 [466 kB]
#6 11.15 Get:238 http://deb.debian.org/debian-security buster/updates/main amd64 libgnutls-dane0 amd64 3.6.7-4+deb10u12 [318 kB]
#6 11.16 Get:239 http://deb.debian.org/debian-security buster/updates/main amd64 libgnutlsxx28 amd64 3.6.7-4+deb10u12 [14.6 kB]
#6 11.16 Get:240 http://deb.debian.org/debian buster/main amd64 libidn2-dev amd64 2.0.5-1+deb10u1 [79.5 kB]
#6 11.16 Get:241 http://deb.debian.org/debian buster/main amd64 libp11-kit-dev amd64 0.23.15-2+deb10u1 [196 kB]
#6 11.16 Get:242 http://deb.debian.org/debian-security buster/updates/main amd64 libtasn1-6-dev amd64 4.13-3+deb10u1 [104 kB]
#6 11.16 Get:243 http://deb.debian.org/debian buster/main amd64 nettle-dev amd64 3.4.1-1+deb10u1 [1077 kB]
#6 11.18 Get:244 http://deb.debian.org/debian-security buster/updates/main amd64 libgnutls28-dev amd64 3.6.7-4+deb10u12 [1087 kB]
#6 11.21 Get:245 http://deb.debian.org/debian buster/main amd64 libgps23 amd64 3.17-7 [89.9 kB]
#6 11.22 Get:246 http://deb.debian.org/debian buster/main amd64 libgps-dev amd64 3.17-7 [138 kB]
#6 11.22 Get:247 http://deb.debian.org/debian buster/main amd64 libgsm1 amd64 1.0.18-2 [27.7 kB]
#6 11.22 Get:248 http://deb.debian.org/debian buster/main amd64 libgsm1-dev amd64 1.0.18-2 [29.7 kB]
#6 11.22 Get:249 http://deb.debian.org/debian-security buster/updates/main amd64 libncurses-dev amd64 6.1+20181013-2+deb10u5 [333 kB]
#6 11.22 Get:250 http://deb.debian.org/debian-security buster/updates/main amd64 libncurses5-dev amd64 6.1+20181013-2+deb10u5 [948 B]
#6 11.22 Get:251 http://deb.debian.org/debian buster/main amd64 libnewlib-dev all 3.1.0.20181231-1 [259 kB]
#6 11.22 Get:252 http://deb.debian.org/debian buster/main amd64 libnewlib-arm-none-eabi all 3.1.0.20181231-1 [32.1 MB]
#6 11.72 Get:253 http://deb.debian.org/debian buster/main amd64 libortp13 amd64 1:1.0.2-1 [74.4 kB]
#6 11.72 Get:254 http://deb.debian.org/debian buster/main amd64 libortp-dev amd64 1:1.0.2-1 [102 kB]
#6 11.72 Get:255 http://deb.debian.org/debian buster/main amd64 libpcap0.8 amd64 1.8.1-6+deb10u1 [140 kB]
#6 11.72 Get:256 http://deb.debian.org/debian buster/main amd64 libpcap0.8-dev amd64 1.8.1-6+deb10u1 [241 kB]
#6 11.72 Get:257 http://deb.debian.org/debian buster/main amd64 libpcap-dev amd64 1.8.1-6+deb10u1 [26.0 kB]
#6 11.72 Get:258 http://deb.debian.org/debian buster/main amd64 libpcsclite1 amd64 1.8.24-1 [58.5 kB]
#6 11.72 Get:259 http://deb.debian.org/debian buster/main amd64 libpcsclite-dev amd64 1.8.24-1 [75.0 kB]
#6 11.72 Get:260 http://deb.debian.org/debian buster/main amd64 libreadline-dev amd64 7.0-5 [133 kB]
#6 11.72 Get:261 http://deb.debian.org/debian buster/main amd64 libsctp1 amd64 1.0.18+dfsg-1 [28.3 kB]
#6 11.72 Get:262 http://deb.debian.org/debian buster/main amd64 libsctp-dev amd64 1.0.18+dfsg-1 [81.5 kB]
#6 11.73 Get:263 http://deb.debian.org/debian-security buster/updates/main amd64 libsofia-sip-ua0 amd64 1.12.11+20110422.1-2.1+deb10u4 [535 kB]
#6 11.73 Get:264 http://deb.debian.org/debian-security buster/updates/main amd64 libsofia-sip-ua-dev amd64 1.12.11+20110422.1-2.1+deb10u4 [760 kB]
#6 11.74 Get:265 http://deb.debian.org/debian-security buster/updates/main amd64 libsofia-sip-ua-glib3 amd64 1.12.11+20110422.1-2.1+deb10u4 [16.5 kB]
#6 11.74 Get:266 http://deb.debian.org/debian-security buster/updates/main amd64 libsofia-sip-ua-glib-dev amd64 1.12.11+20110422.1-2.1+deb10u4 [16.0 kB]
#6 11.74 Get:267 http://deb.debian.org/debian-security buster/updates/main amd64 libsqlite3-dev amd64 3.27.2-3+deb10u2 [787 kB]
#6 11.75 Get:268 http://deb.debian.org/debian-security buster/updates/main amd64 libssl-dev amd64 1.1.1n-0+deb10u6 [1810 kB]
#6 11.78 Get:269 http://deb.debian.org/debian buster/main amd64 libtalloc2 amd64 2.1.14-2 [35.4 kB]
#6 11.78 Get:270 http://deb.debian.org/debian buster/main amd64 libtalloc-dev amd64 2.1.14-2 [61.1 kB]
#6 11.78 Get:271 http://deb.debian.org/debian buster/main amd64 libusb-0.1-4 amd64 2:0.1.12-32 [23.4 kB]
#6 11.78 Get:272 http://deb.debian.org/debian buster/main amd64 libusb-1.0-0 amd64 2:1.0.22-2 [55.3 kB]
#6 11.78 Get:273 http://deb.debian.org/debian buster/main amd64 libusb-1.0-0-dev amd64 2:1.0.22-2 [74.5 kB]
#6 11.78 Get:274 http://deb.debian.org/debian buster/main amd64 libusb-dev amd64 2:0.1.12-32 [37.9 kB]
#6 11.78 Get:275 http://deb.debian.org/debian buster/main amd64 netcat-openbsd amd64 1.195-2 [41.2 kB]
#6 11.78 Get:276 http://deb.debian.org/debian-security buster/updates/main amd64 sqlite3 amd64 3.27.2-3+deb10u2 [940 kB]
#6 11.79 Get:277 http://deb.debian.org/debian buster/main amd64 stow all 2.2.2-1 [367 kB]
#6 11.80 Get:278 http://deb.debian.org/debian buster/main amd64 tcpdump amd64 4.9.3-1~deb10u2 [400 kB]
#6 11.80 Get:279 http://deb.debian.org/debian-security buster/updates/main amd64 libc-ares2 amd64 1.14.0-1+deb10u4 [86.5 kB]
#6 11.81 Get:280 http://deb.debian.org/debian-security buster/updates/main amd64 libc-ares-dev amd64 1.14.0-1+deb10u4 [161 kB]
#6 11.88 debconf: delaying package configuration, since apt-utils is not installed
#6 11.89 Fetched 227 MB in 3s (86.6 MB/s)
#6 12.10 Selecting previously unselected package libbsd0:amd64.
#6 12.10 (Reading database ... 
(Reading database ... 5%
(Reading database ... 10%
(Reading database ... 15%
(Reading database ... 20%
(Reading database ... 25%
(Reading database ... 30%
(Reading database ... 35%
(Reading database ... 40%
(Reading database ... 45%
(Reading database ... 50%
(Reading database ... 55%
(Reading database ... 60%
(Reading database ... 65%
(Reading database ... 70%
(Reading database ... 75%
(Reading database ... 80%
(Reading database ... 85%
(Reading database ... 90%
(Reading database ... 95%
(Reading database ... 100%
(Reading database ... 6650 files and directories currently installed.)
#6 12.11 Preparing to unpack .../00-libbsd0_0.9.1-2+deb10u1_amd64.deb ...
#6 12.15 Unpacking libbsd0:amd64 (0.9.1-2+deb10u1) ...
#6 12.29 Selecting previously unselected package bsdmainutils.
#6 12.29 Preparing to unpack .../01-bsdmainutils_11.1.2+b1_amd64.deb ...
#6 12.31 Unpacking bsdmainutils (11.1.2+b1) ...
#6 12.49 Selecting previously unselected package libuchardet0:amd64.
#6 12.49 Preparing to unpack .../02-libuchardet0_0.0.6-3_amd64.deb ...
#6 12.51 Unpacking libuchardet0:amd64 (0.0.6-3) ...
#6 12.65 Selecting previously unselected package groff-base.
#6 12.65 Preparing to unpack .../03-groff-base_1.22.4-3+deb10u1_amd64.deb ...
#6 12.68 Unpacking groff-base (1.22.4-3+deb10u1) ...
#6 12.89 Selecting previously unselected package libgdbm6:amd64.
#6 12.89 Preparing to unpack .../04-libgdbm6_1.18.1-4_amd64.deb ...
#6 12.91 Unpacking libgdbm6:amd64 (1.18.1-4) ...
#6 13.06 Selecting previously unselected package libpipeline1:amd64.
#6 13.06 Preparing to unpack .../05-libpipeline1_1.5.1-2_amd64.deb ...
#6 13.09 Unpacking libpipeline1:amd64 (1.5.1-2) ...
#6 13.29 Selecting previously unselected package man-db.
#6 13.29 Preparing to unpack .../06-man-db_2.8.5-2+deb10u1_amd64.deb ...
#6 13.32 Unpacking man-db (2.8.5-2+deb10u1) ...
#6 13.56 Selecting previously unselected package perl-modules-5.28.
#6 13.56 Preparing to unpack .../07-perl-modules-5.28_5.28.1-6+deb10u1_all.deb ...
#6 13.59 Unpacking perl-modules-5.28 (5.28.1-6+deb10u1) ...
#6 13.97 Selecting previously unselected package libgdbm-compat4:amd64.
#6 13.97 Preparing to unpack .../08-libgdbm-compat4_1.18.1-4_amd64.deb ...
#6 13.98 Unpacking libgdbm-compat4:amd64 (1.18.1-4) ...
#6 14.13 Selecting previously unselected package libperl5.28:amd64.
#6 14.14 Preparing to unpack .../09-libperl5.28_5.28.1-6+deb10u1_amd64.deb ...
#6 14.16 Unpacking libperl5.28:amd64 (5.28.1-6+deb10u1) ...
#6 14.62 Selecting previously unselected package perl.
#6 14.62 Preparing to unpack .../10-perl_5.28.1-6+deb10u1_amd64.deb ...
#6 14.66 Unpacking perl (5.28.1-6+deb10u1) ...
#6 14.82 Selecting previously unselected package autoconf-archive.
#6 14.82 Preparing to unpack .../11-autoconf-archive_20180313-1_all.deb ...
#6 14.84 Unpacking autoconf-archive (20180313-1) ...
#6 15.14 Selecting previously unselected package libsigsegv2:amd64.
#6 15.14 Preparing to unpack .../12-libsigsegv2_2.12-2_amd64.deb ...
#6 15.16 Unpacking libsigsegv2:amd64 (2.12-2) ...
#6 15.29 Selecting previously unselected package m4.
#6 15.29 Preparing to unpack .../13-m4_1.4.18-2_amd64.deb ...
#6 15.31 Unpacking m4 (1.4.18-2) ...
#6 15.47 Selecting previously unselected package flex.
#6 15.47 Preparing to unpack .../14-flex_2.6.4-6.2_amd64.deb ...
#6 15.49 Unpacking flex (2.6.4-6.2) ...
#6 15.89 Selecting previously unselected package libmpfr6:amd64.
#6 15.89 Preparing to unpack .../15-libmpfr6_4.0.2-1_amd64.deb ...
#6 15.94 Unpacking libmpfr6:amd64 (4.0.2-1) ...
#6 16.20 Selecting previously unselected package readline-common.
#6 16.20 Preparing to unpack .../16-readline-common_7.0-5_all.deb ...
#6 16.24 Unpacking readline-common (7.0-5) ...
#6 16.63 Selecting previously unselected package libreadline7:amd64.
#6 16.63 Preparing to unpack .../17-libreadline7_7.0-5_amd64.deb ...
#6 16.68 Unpacking libreadline7:amd64 (7.0-5) ...
#6 16.95 Setting up libmpfr6:amd64 (4.0.2-1) ...
#6 17.11 Setting up readline-common (7.0-5) ...
#6 17.28 Setting up libreadline7:amd64 (7.0-5) ...
#6 17.44 Setting up libsigsegv2:amd64 (2.12-2) ...
#6 17.79 Selecting previously unselected package gawk.
#6 17.79 (Reading database ... 
(Reading database ... 5%
(Reading database ... 10%
(Reading database ... 15%
(Reading database ... 20%
(Reading database ... 25%
(Reading database ... 30%
(Reading database ... 35%
(Reading database ... 40%
(Reading database ... 45%
(Reading database ... 50%
(Reading database ... 55%
(Reading database ... 60%
(Reading database ... 65%
(Reading database ... 70%
(Reading database ... 75%
(Reading database ... 80%
(Reading database ... 85%
(Reading database ... 90%
(Reading database ... 95%
(Reading database ... 100%
(Reading database ... 10596 files and directories currently installed.)
#6 17.79 Preparing to unpack .../gawk_1%3a4.2.1+dfsg-1_amd64.deb ...
#6 17.83 Unpacking gawk (1:4.2.1+dfsg-1) ...
#6 18.19 Selecting previously unselected package libssl1.1:amd64.
#6 18.19 Preparing to unpack .../libssl1.1_1.1.1n-0+deb10u6_amd64.deb ...
#6 18.24 Unpacking libssl1.1:amd64 (1.1.1n-0+deb10u6) ...
#6 18.64 Selecting previously unselected package libpython3.7-minimal:amd64.
#6 18.64 Preparing to unpack .../libpython3.7-minimal_3.7.3-2+deb10u7_amd64.deb ...
#6 18.68 Unpacking libpython3.7-minimal:amd64 (3.7.3-2+deb10u7) ...
#6 19.17 Selecting previously unselected package libexpat1:amd64.
#6 19.17 Preparing to unpack .../libexpat1_2.2.6-2+deb10u7_amd64.deb ...
#6 19.22 Unpacking libexpat1:amd64 (2.2.6-2+deb10u7) ...
#6 19.66 Selecting previously unselected package python3.7-minimal.
#6 19.66 Preparing to unpack .../python3.7-minimal_3.7.3-2+deb10u7_amd64.deb ...
#6 19.70 Unpacking python3.7-minimal (3.7.3-2+deb10u7) ...
#6 22.21 Setting up libssl1.1:amd64 (1.1.1n-0+deb10u6) ...
#6 22.33 debconf: unable to initialize frontend: Dialog
#6 22.33 debconf: (TERM is not set, so the dialog frontend is not usable.)
#6 22.33 debconf: falling back to frontend: Readline
#6 22.43 Setting up libpython3.7-minimal:amd64 (3.7.3-2+deb10u7) ...
#6 22.61 Setting up libexpat1:amd64 (2.2.6-2+deb10u7) ...
#6 23.00 Setting up python3.7-minimal (3.7.3-2+deb10u7) ...
#6 23.60 Selecting previously unselected package python3-minimal.
#6 23.60 (Reading database ... 
(Reading database ... 5%
(Reading database ... 10%
(Reading database ... 15%
(Reading database ... 20%
(Reading database ... 25%
(Reading database ... 30%
(Reading database ... 35%
(Reading database ... 40%
(Reading database ... 45%
(Reading database ... 50%
(Reading database ... 55%
(Reading database ... 60%
(Reading database ... 65%
(Reading database ... 70%
(Reading database ... 75%
(Reading database ... 80%
(Reading database ... 85%
(Reading database ... 90%
(Reading database ... 95%
(Reading database ... 100%
(Reading database ... 11026 files and directories currently installed.)
#6 23.60 Preparing to unpack .../0-python3-minimal_3.7.3-1_amd64.deb ...
#6 23.66 Unpacking python3-minimal (3.7.3-1) ...
#6 24.07 Selecting previously unselected package mime-support.
#6 24.07 Preparing to unpack .../1-mime-support_3.62_all.deb ...
#6 24.12 Unpacking mime-support (3.62) ...
#6 24.61 Selecting previously unselected package libmpdec2:amd64.
#6 24.61 Preparing to unpack .../2-libmpdec2_2.4.2-2_amd64.deb ...
#6 24.65 Unpacking libmpdec2:amd64 (2.4.2-2) ...
#6 24.93 Selecting previously unselected package libsqlite3-0:amd64.
#6 24.93 Preparing to unpack .../3-libsqlite3-0_3.27.2-3+deb10u2_amd64.deb ...
#6 24.98 Unpacking libsqlite3-0:amd64 (3.27.2-3+deb10u2) ...
#6 25.40 Selecting previously unselected package libpython3.7-stdlib:amd64.
#6 25.40 Preparing to unpack .../4-libpython3.7-stdlib_3.7.3-2+deb10u7_amd64.deb ...
#6 25.44 Unpacking libpython3.7-stdlib:amd64 (3.7.3-2+deb10u7) ...
#6 25.84 Selecting previously unselected package python3.7.
#6 25.85 Preparing to unpack .../5-python3.7_3.7.3-2+deb10u7_amd64.deb ...
#6 25.90 Unpacking python3.7 (3.7.3-2+deb10u7) ...
#6 26.20 Selecting previously unselected package libpython3-stdlib:amd64.
#6 26.20 Preparing to unpack .../6-libpython3-stdlib_3.7.3-1_amd64.deb ...
#6 26.24 Unpacking libpython3-stdlib:amd64 (3.7.3-1) ...
#6 43.08 Setting up python3-minimal (3.7.3-1) ...
#6 43.86 Selecting previously unselected package python3.
#6 43.86 (Reading database ... 
(Reading database ... 5%
(Reading database ... 10%
(Reading database ... 15%
(Reading database ... 20%
(Reading database ... 25%
(Reading database ... 30%
(Reading database ... 35%
(Reading database ... 40%
(Reading database ... 45%
(Reading database ... 50%
(Reading database ... 55%
(Reading database ... 60%
(Reading database ... 65%
(Reading database ... 70%
(Reading database ... 75%
(Reading database ... 80%
(Reading database ... 85%
(Reading database ... 90%
(Reading database ... 95%
(Reading database ... 100%
(Reading database ... 11471 files and directories currently installed.)
#6 43.87 Preparing to unpack .../000-python3_3.7.3-1_amd64.deb ...
#6 43.92 Unpacking python3 (3.7.3-1) ...
#6 44.36 Selecting previously unselected package libxapian30:amd64.
#6 44.36 Preparing to unpack .../001-libxapian30_1.4.11-1+deb10u1_amd64.deb ...
#6 44.56 Unpacking libxapian30:amd64 (1.4.11-1+deb10u1) ...
#6 45.05 Selecting previously unselected package netbase.
#6 45.05 Preparing to unpack .../002-netbase_5.6_all.deb ...
#6 45.09 Unpacking netbase (5.6) ...
#6 45.44 Selecting previously unselected package sensible-utils.
#6 45.44 Preparing to unpack .../003-sensible-utils_0.0.12_all.deb ...
#6 45.49 Unpacking sensible-utils (0.0.12) ...
#6 45.86 Selecting previously unselected package bzip2.
#6 45.86 Preparing to unpack .../004-bzip2_1.0.6-9.2~deb10u2_amd64.deb ...
#6 45.92 Unpacking bzip2 (1.0.6-9.2~deb10u2) ...
#6 46.28 Selecting previously unselected package libmagic-mgc.
#6 46.28 Preparing to unpack .../005-libmagic-mgc_1%3a5.35-4+deb10u2_amd64.deb ...
#6 46.32 Unpacking libmagic-mgc (1:5.35-4+deb10u2) ...
#6 46.70 Selecting previously unselected package libmagic1:amd64.
#6 46.70 Preparing to unpack .../006-libmagic1_1%3a5.35-4+deb10u2_amd64.deb ...
#6 46.75 Unpacking libmagic1:amd64 (1:5.35-4+deb10u2) ...
#6 47.02 Selecting previously unselected package file.
#6 47.02 Preparing to unpack .../007-file_1%3a5.35-4+deb10u2_amd64.deb ...
#6 47.06 Unpacking file (1:5.35-4+deb10u2) ...
#6 47.49 Selecting previously unselected package gettext-base.
#6 47.49 Preparing to unpack .../008-gettext-base_0.19.8.1-9_amd64.deb ...
#6 47.54 Unpacking gettext-base (0.19.8.1-9) ...
#6 47.87 Selecting previously unselected package libgnutls-openssl27:amd64.
#6 47.87 Preparing to unpack .../009-libgnutls-openssl27_3.6.7-4+deb10u12_amd64.deb ...
#6 47.91 Unpacking libgnutls-openssl27:amd64 (3.6.7-4+deb10u12) ...
#6 48.70 Selecting previously unselected package libkeyutils1:amd64.
#6 48.70 Preparing to unpack .../010-libkeyutils1_1.6-6_amd64.deb ...
#6 48.75 Unpacking libkeyutils1:amd64 (1.6-6) ...
#6 49.07 Selecting previously unselected package libkrb5support0:amd64.
#6 49.07 Preparing to unpack .../011-libkrb5support0_1.17-3+deb10u6_amd64.deb ...
#6 49.11 Unpacking libkrb5support0:amd64 (1.17-3+deb10u6) ...
#6 50.04 Selecting previously unselected package libk5crypto3:amd64.
#6 50.04 Preparing to unpack .../012-libk5crypto3_1.17-3+deb10u6_amd64.deb ...
#6 50.09 Unpacking libk5crypto3:amd64 (1.17-3+deb10u6) ...
#6 50.84 Selecting previously unselected package libkrb5-3:amd64.
#6 50.85 Preparing to unpack .../013-libkrb5-3_1.17-3+deb10u6_amd64.deb ...
#6 50.93 Unpacking libkrb5-3:amd64 (1.17-3+deb10u6) ...
#6 51.67 Selecting previously unselected package libgssapi-krb5-2:amd64.
#6 51.67 Preparing to unpack .../014-libgssapi-krb5-2_1.17-3+deb10u6_amd64.deb ...
#6 51.92 Unpacking libgssapi-krb5-2:amd64 (1.17-3+deb10u6) ...
#6 55.88 Selecting previously unselected package libicu63:amd64.
#6 55.88 Preparing to unpack .../015-libicu63_63.1-6+deb10u3_amd64.deb ...
#6 55.93 Unpacking libicu63:amd64 (63.1-6+deb10u3) ...
#6 57.17 Selecting previously unselected package libxml2:amd64.
#6 57.18 Preparing to unpack .../016-libxml2_2.9.4+dfsg1-7+deb10u6_amd64.deb ...
#6 57.22 Unpacking libxml2:amd64 (2.9.4+dfsg1-7+deb10u6) ...
#6 57.60 Selecting previously unselected package telnet.
#6 57.60 Preparing to unpack .../017-telnet_0.17-41.2_amd64.deb ...
#6 57.74 Unpacking telnet (0.17-41.2) ...
#6 58.25 Selecting previously unselected package libpcre2-8-0:amd64.
#6 58.25 Preparing to unpack .../018-libpcre2-8-0_10.32-5+deb10u1_amd64.deb ...
#6 58.40 Unpacking libpcre2-8-0:amd64 (10.32-5+deb10u1) ...
#6 58.80 Selecting previously unselected package libpsl5:amd64.
#6 58.80 Preparing to unpack .../019-libpsl5_0.20.2-2_amd64.deb ...
#6 58.85 Unpacking libpsl5:amd64 (0.20.2-2) ...
#6 59.15 Selecting previously unselected package wget.
#6 59.15 Preparing to unpack .../020-wget_1.20.1-1.1_amd64.deb ...
#6 59.20 Unpacking wget (1.20.1-1.1) ...
#6 60.26 Selecting previously unselected package xz-utils.
#6 60.26 Preparing to unpack .../021-xz-utils_5.2.4-1+deb10u1_amd64.deb ...
#6 60.30 Unpacking xz-utils (5.2.4-1+deb10u1) ...
#6 60.60 Selecting previously unselected package autoconf.
#6 60.60 Preparing to unpack .../022-autoconf_2.69-11_all.deb ...
#6 60.65 Unpacking autoconf (2.69-11) ...
#6 61.13 Selecting previously unselected package libgc1c2:amd64.
#6 61.13 Preparing to unpack .../023-libgc1c2_1%3a7.6.4-0.4_amd64.deb ...
#6 61.20 Unpacking libgc1c2:amd64 (1:7.6.4-0.4) ...
#6 61.51 Selecting previously unselected package libltdl7:amd64.
#6 61.51 Preparing to unpack .../024-libltdl7_2.4.6-9_amd64.deb ...
#6 61.56 Unpacking libltdl7:amd64 (2.4.6-9) ...
#6 61.91 Selecting previously unselected package libncurses6:amd64.
#6 61.92 Preparing to unpack .../025-libncurses6_6.1+20181013-2+deb10u5_amd64.deb ...
#6 61.96 Unpacking libncurses6:amd64 (6.1+20181013-2+deb10u5) ...
#6 62.32 Selecting previously unselected package guile-2.0-libs:amd64.
#6 62.32 Preparing to unpack .../026-guile-2.0-libs_2.0.13+1-5.1_amd64.deb ...
#6 62.37 Unpacking guile-2.0-libs:amd64 (2.0.13+1-5.1) ...
#6 63.27 Selecting previously unselected package libopts25:amd64.
#6 63.28 Preparing to unpack .../027-libopts25_1%3a5.18.12-4_amd64.deb ...
#6 63.41 Unpacking libopts25:amd64 (1:5.18.12-4) ...
#6 64.09 Selecting previously unselected package libopts25-dev:amd64.
#6 64.09 Preparing to unpack .../028-libopts25-dev_1%3a5.18.12-4_amd64.deb ...
#6 64.14 Unpacking libopts25-dev:amd64 (1:5.18.12-4) ...
#6 64.44 Selecting previously unselected package autogen.
#6 64.44 Preparing to unpack .../029-autogen_1%3a5.18.12-4_amd64.deb ...
#6 64.48 Unpacking autogen (1:5.18.12-4) ...
#6 64.50 Replaced by files in installed package libopts25-dev:amd64 (1:5.18.12-4) ...
#6 64.77 Selecting previously unselected package autotools-dev.
#6 64.77 Preparing to unpack .../030-autotools-dev_20180224.1_all.deb ...
#6 64.83 Unpacking autotools-dev (20180224.1) ...
#6 65.15 Selecting previously unselected package automake.
#6 65.16 Preparing to unpack .../031-automake_1%3a1.16.1-4_all.deb ...
#6 65.21 Unpacking automake (1:1.16.1-4) ...
#6 65.50 Selecting previously unselected package autopoint.
#6 65.50 Preparing to unpack .../032-autopoint_0.19.8.1-9_all.deb ...
#6 65.64 Unpacking autopoint (0.19.8.1-9) ...
#6 66.08 Selecting previously unselected package binutils-common:amd64.
#6 66.08 Preparing to unpack .../033-binutils-common_2.31.1-16_amd64.deb ...
#6 66.12 Unpacking binutils-common:amd64 (2.31.1-16) ...
#6 66.51 Selecting previously unselected package libbinutils:amd64.
#6 66.51 Preparing to unpack .../034-libbinutils_2.31.1-16_amd64.deb ...
#6 66.57 Unpacking libbinutils:amd64 (2.31.1-16) ...
#6 66.82 Selecting previously unselected package binutils-x86-64-linux-gnu.
#6 66.82 Preparing to unpack .../035-binutils-x86-64-linux-gnu_2.31.1-16_amd64.deb ...
#6 66.88 Unpacking binutils-x86-64-linux-gnu (2.31.1-16) ...
#6 67.29 Selecting previously unselected package binutils.
#6 67.29 Preparing to unpack .../036-binutils_2.31.1-16_amd64.deb ...
#6 67.34 Unpacking binutils (2.31.1-16) ...
#6 67.62 Selecting previously unselected package binutils-arm-none-eabi.
#6 67.62 Preparing to unpack .../037-binutils-arm-none-eabi_2.31.1-12+11_amd64.deb ...
#6 67.67 Unpacking binutils-arm-none-eabi (2.31.1-12+11) ...
#6 68.02 Selecting previously unselected package libbison-dev:amd64.
#6 68.02 Preparing to unpack .../038-libbison-dev_2%3a3.3.2.dfsg-1_amd64.deb ...
#6 68.06 Unpacking libbison-dev:amd64 (2:3.3.2.dfsg-1) ...
#6 68.55 Selecting previously unselected package bison.
#6 68.55 Preparing to unpack .../039-bison_2%3a3.3.2.dfsg-1_amd64.deb ...
#6 68.60 Unpacking bison (2:3.3.2.dfsg-1) ...
#6 69.08 Selecting previously unselected package libc-dev-bin.
#6 69.08 Preparing to unpack .../040-libc-dev-bin_2.28-10+deb10u4_amd64.deb ...
#6 69.12 Unpacking libc-dev-bin (2.28-10+deb10u4) ...
#6 69.39 Selecting previously unselected package linux-libc-dev:amd64.
#6 69.39 Preparing to unpack .../041-linux-libc-dev_4.19.316-1_amd64.deb ...
#6 69.48 Unpacking linux-libc-dev:amd64 (4.19.316-1) ...
#6 69.77 Selecting previously unselected package libc6-dev:amd64.
#6 69.77 Preparing to unpack .../042-libc6-dev_2.28-10+deb10u4_amd64.deb ...
#6 69.82 Unpacking libc6-dev:amd64 (2.28-10+deb10u4) ...
#6 70.29 Selecting previously unselected package libisl19:amd64.
#6 70.29 Preparing to unpack .../043-libisl19_0.20-2_amd64.deb ...
#6 70.33 Unpacking libisl19:amd64 (0.20-2) ...
#6 70.68 Selecting previously unselected package libmpc3:amd64.
#6 70.68 Preparing to unpack .../044-libmpc3_1.1.0-1_amd64.deb ...
#6 70.72 Unpacking libmpc3:amd64 (1.1.0-1) ...
#6 70.97 Selecting previously unselected package cpp-8.
#6 70.97 Preparing to unpack .../045-cpp-8_8.3.0-6_amd64.deb ...
#6 71.02 Unpacking cpp-8 (8.3.0-6) ...
#6 71.69 Selecting previously unselected package cpp.
#6 71.69 Preparing to unpack .../046-cpp_4%3a8.3.0-1_amd64.deb ...
#6 71.73 Unpacking cpp (4:8.3.0-1) ...
#6 72.02 Selecting previously unselected package libcc1-0:amd64.
#6 72.03 Preparing to unpack .../047-libcc1-0_8.3.0-6_amd64.deb ...
#6 72.06 Unpacking libcc1-0:amd64 (8.3.0-6) ...
#6 72.38 Selecting previously unselected package libgomp1:amd64.
#6 72.39 Preparing to unpack .../048-libgomp1_8.3.0-6_amd64.deb ...
#6 72.43 Unpacking libgomp1:amd64 (8.3.0-6) ...
#6 72.75 Selecting previously unselected package libitm1:amd64.
#6 72.75 Preparing to unpack .../049-libitm1_8.3.0-6_amd64.deb ...
#6 72.79 Unpacking libitm1:amd64 (8.3.0-6) ...
#6 73.10 Selecting previously unselected package libatomic1:amd64.
#6 73.10 Preparing to unpack .../050-libatomic1_8.3.0-6_amd64.deb ...
#6 73.14 Unpacking libatomic1:amd64 (8.3.0-6) ...
#6 73.46 Selecting previously unselected package libasan5:amd64.
#6 73.46 Preparing to unpack .../051-libasan5_8.3.0-6_amd64.deb ...
#6 73.50 Unpacking libasan5:amd64 (8.3.0-6) ...
#6 74.33 Selecting previously unselected package liblsan0:amd64.
#6 74.33 Preparing to unpack .../052-liblsan0_8.3.0-6_amd64.deb ...
#6 74.37 Unpacking liblsan0:amd64 (8.3.0-6) ...
#6 74.67 Selecting previously unselected package libtsan0:amd64.
#6 74.68 Preparing to unpack .../053-libtsan0_8.3.0-6_amd64.deb ...
#6 74.72 Unpacking libtsan0:amd64 (8.3.0-6) ...
#6 75.05 Selecting previously unselected package libubsan1:amd64.
#6 75.05 Preparing to unpack .../054-libubsan1_8.3.0-6_amd64.deb ...
#6 75.10 Unpacking libubsan1:amd64 (8.3.0-6) ...
#6 75.42 Selecting previously unselected package libmpx2:amd64.
#6 75.43 Preparing to unpack .../055-libmpx2_8.3.0-6_amd64.deb ...
#6 75.47 Unpacking libmpx2:amd64 (8.3.0-6) ...
#6 75.78 Selecting previously unselected package libquadmath0:amd64.
#6 75.79 Preparing to unpack .../056-libquadmath0_8.3.0-6_amd64.deb ...
#6 75.82 Unpacking libquadmath0:amd64 (8.3.0-6) ...
#6 76.06 Selecting previously unselected package libgcc-8-dev:amd64.
#6 76.06 Preparing to unpack .../057-libgcc-8-dev_8.3.0-6_amd64.deb ...
#6 76.10 Unpacking libgcc-8-dev:amd64 (8.3.0-6) ...
#6 76.45 Selecting previously unselected package gcc-8.
#6 76.46 Preparing to unpack .../058-gcc-8_8.3.0-6_amd64.deb ...
#6 76.50 Unpacking gcc-8 (8.3.0-6) ...
#6 77.21 Selecting previously unselected package gcc.
#6 77.21 Preparing to unpack .../059-gcc_4%3a8.3.0-1_amd64.deb ...
#6 77.25 Unpacking gcc (4:8.3.0-1) ...
#6 77.49 Selecting previously unselected package libstdc++-8-dev:amd64.
#6 77.49 Preparing to unpack .../060-libstdc++-8-dev_8.3.0-6_amd64.deb ...
#6 77.53 Unpacking libstdc++-8-dev:amd64 (8.3.0-6) ...
#6 77.86 Selecting previously unselected package g++-8.
#6 77.87 Preparing to unpack .../061-g++-8_8.3.0-6_amd64.deb ...
#6 77.90 Unpacking g++-8 (8.3.0-6) ...
#6 78.61 Selecting previously unselected package g++.
#6 78.62 Preparing to unpack .../062-g++_4%3a8.3.0-1_amd64.deb ...
#6 78.66 Unpacking g++ (4:8.3.0-1) ...
#6 78.89 Selecting previously unselected package make.
#6 78.89 Preparing to unpack .../063-make_4.2.1-1.2_amd64.deb ...
#6 78.94 Unpacking make (4.2.1-1.2) ...
#6 79.21 Selecting previously unselected package libdpkg-perl.
#6 79.21 Preparing to unpack .../064-libdpkg-perl_1.19.8_all.deb ...
#6 79.25 Unpacking libdpkg-perl (1.19.8) ...
#6 79.51 Selecting previously unselected package patch.
#6 79.52 Preparing to unpack .../065-patch_2.7.6-3+deb10u1_amd64.deb ...
#6 79.55 Unpacking patch (2.7.6-3+deb10u1) ...
#6 79.83 Selecting previously unselected package dpkg-dev.
#6 79.83 Preparing to unpack .../066-dpkg-dev_1.19.8_all.deb ...
#6 79.87 Unpacking dpkg-dev (1.19.8) ...
#6 80.16 Selecting previously unselected package build-essential.
#6 80.16 Preparing to unpack .../067-build-essential_12.6_amd64.deb ...
#6 80.20 Unpacking build-essential (12.6) ...
#6 80.46 Selecting previously unselected package openssl.
#6 80.47 Preparing to unpack .../068-openssl_1.1.1n-0+deb10u6_amd64.deb ...
#6 80.51 Unpacking openssl (1.1.1n-0+deb10u6) ...
#6 80.89 Selecting previously unselected package ca-certificates.
#6 80.89 Preparing to unpack .../069-ca-certificates_20200601~deb10u2_all.deb ...
#6 80.93 Unpacking ca-certificates (20200601~deb10u2) ...
#6 81.33 Selecting previously unselected package libtinyxml2-6a:amd64.
#6 81.33 Preparing to unpack .../070-libtinyxml2-6a_7.0.0+dfsg-1_amd64.deb ...
#6 81.37 Unpacking libtinyxml2-6a:amd64 (7.0.0+dfsg-1) ...
#6 81.61 Selecting previously unselected package python3-pygments.
#6 81.61 Preparing to unpack .../071-python3-pygments_2.3.1+dfsg-1+deb10u2_all.deb ...
#6 81.65 Unpacking python3-pygments (2.3.1+dfsg-1+deb10u2) ...
#6 81.91 Selecting previously unselected package cppcheck.
#6 81.91 Preparing to unpack .../072-cppcheck_1.86-1_amd64.deb ...
#6 81.95 Unpacking cppcheck (1.86-1) ...
#6 82.25 Selecting previously unselected package libtool.
#6 82.26 Preparing to unpack .../073-libtool_2.4.6-9_all.deb ...
#6 82.30 Unpacking libtool (2.4.6-9) ...
#6 82.56 Selecting previously unselected package dh-autoreconf.
#6 82.56 Preparing to unpack .../074-dh-autoreconf_19_all.deb ...
#6 82.60 Unpacking dh-autoreconf (19) ...
#6 82.84 Selecting previously unselected package libarchive-zip-perl.
#6 82.84 Preparing to unpack .../075-libarchive-zip-perl_1.64-1_all.deb ...
#6 82.88 Unpacking libarchive-zip-perl (1.64-1) ...
#6 83.13 Selecting previously unselected package libfile-stripnondeterminism-perl.
#6 83.13 Preparing to unpack .../076-libfile-stripnondeterminism-perl_1.1.2-1_all.deb ...
#6 83.17 Unpacking libfile-stripnondeterminism-perl (1.1.2-1) ...
#6 83.38 Selecting previously unselected package dh-strip-nondeterminism.
#6 83.39 Preparing to unpack .../077-dh-strip-nondeterminism_1.1.2-1_all.deb ...
#6 83.43 Unpacking dh-strip-nondeterminism (1.1.2-1) ...
#6 83.66 Selecting previously unselected package dwz.
#6 83.67 Preparing to unpack .../078-dwz_0.12-3_amd64.deb ...
#6 83.71 Unpacking dwz (0.12-3) ...
#6 84.08 Selecting previously unselected package libglib2.0-0:amd64.
#6 84.09 Preparing to unpack .../079-libglib2.0-0_2.58.3-2+deb10u6_amd64.deb ...
#6 85.09 Unpacking libglib2.0-0:amd64 (2.58.3-2+deb10u6) ...
#6 85.50 Selecting previously unselected package libcroco3:amd64.
#6 85.50 Preparing to unpack .../080-libcroco3_0.6.12-3_amd64.deb ...
#6 85.55 Unpacking libcroco3:amd64 (0.6.12-3) ...
#6 85.83 Selecting previously unselected package gettext.
#6 85.83 Preparing to unpack .../081-gettext_0.19.8.1-9_amd64.deb ...
#6 85.88 Unpacking gettext (0.19.8.1-9) ...
#6 86.18 Selecting previously unselected package intltool-debian.
#6 86.19 Preparing to unpack .../082-intltool-debian_0.35.0+20060710.5_all.deb ...
#6 86.23 Unpacking intltool-debian (0.35.0+20060710.5) ...
#6 86.51 Selecting previously unselected package po-debconf.
#6 86.51 Preparing to unpack .../083-po-debconf_1.0.21_all.deb ...
#6 86.55 Unpacking po-debconf (1.0.21) ...
#6 86.89 Selecting previously unselected package debhelper.
#6 86.89 Preparing to unpack .../084-debhelper_12.1.1_all.deb ...
#6 86.93 Unpacking debhelper (12.1.1) ...
#6 87.22 Selecting previously unselected package libtext-charwidth-perl.
#6 87.22 Preparing to unpack .../085-libtext-charwidth-perl_0.04-7.1+b1_amd64.deb ...
#6 87.26 Unpacking libtext-charwidth-perl (0.04-7.1+b1) ...
#6 87.48 Selecting previously unselected package libtext-wrapi18n-perl.
#6 87.48 Preparing to unpack .../086-libtext-wrapi18n-perl_0.06-7.1_all.deb ...
#6 87.52 Unpacking libtext-wrapi18n-perl (0.06-7.1) ...
#6 87.82 Selecting previously unselected package module-assistant.
#6 87.82 Preparing to unpack .../087-module-assistant_0.11.10_all.deb ...
#6 87.87 Unpacking module-assistant (0.11.10) ...
#6 88.10 Selecting previously unselected package dahdi-source.
#6 88.11 Preparing to unpack .../088-dahdi-source_1%3a2.11.1.0.20170917~dfsg-7_all.deb ...
#6 88.14 Unpacking dahdi-source (1:2.11.1.0.20170917~dfsg-7) ...
#6 88.46 Selecting previously unselected package libfakeroot:amd64.
#6 88.47 Preparing to unpack .../089-libfakeroot_1.23-1_amd64.deb ...
#6 88.50 Unpacking libfakeroot:amd64 (1.23-1) ...
#6 88.77 Selecting previously unselected package fakeroot.
#6 88.78 Preparing to unpack .../090-fakeroot_1.23-1_amd64.deb ...
#6 88.81 Unpacking fakeroot (1.23-1) ...
#6 89.08 Selecting previously unselected package libassuan0:amd64.
#6 89.09 Preparing to unpack .../091-libassuan0_2.5.2-1_amd64.deb ...
#6 89.13 Unpacking libassuan0:amd64 (2.5.2-1) ...
#6 89.34 Selecting previously unselected package gpgconf.
#6 89.35 Preparing to unpack .../092-gpgconf_2.2.12-1+deb10u2_amd64.deb ...
#6 89.39 Unpacking gpgconf (2.2.12-1+deb10u2) ...
#6 89.62 Selecting previously unselected package lsb-base.
#6 89.62 Preparing to unpack .../093-lsb-base_10.2019051400_all.deb ...
#6 89.73 Unpacking lsb-base (10.2019051400) ...
#6 90.16 Selecting previously unselected package libksba8:amd64.
#6 90.17 Preparing to unpack .../094-libksba8_1.3.5-2+deb10u2_amd64.deb ...
#6 90.30 Unpacking libksba8:amd64 (1.3.5-2+deb10u2) ...
#6 90.53 Selecting previously unselected package libsasl2-modules-db:amd64.
#6 90.54 Preparing to unpack .../095-libsasl2-modules-db_2.1.27+dfsg-1+deb10u2_amd64.deb ...
#6 90.58 Unpacking libsasl2-modules-db:amd64 (2.1.27+dfsg-1+deb10u2) ...
#6 90.83 Selecting previously unselected package libsasl2-2:amd64.
#6 90.83 Preparing to unpack .../096-libsasl2-2_2.1.27+dfsg-1+deb10u2_amd64.deb ...
#6 90.87 Unpacking libsasl2-2:amd64 (2.1.27+dfsg-1+deb10u2) ...
#6 91.11 Selecting previously unselected package libldap-common.
#6 91.12 Preparing to unpack .../097-libldap-common_2.4.47+dfsg-3+deb10u7_all.deb ...
#6 91.15 Unpacking libldap-common (2.4.47+dfsg-3+deb10u7) ...
#6 91.44 Selecting previously unselected package libldap-2.4-2:amd64.
#6 91.44 Preparing to unpack .../098-libldap-2.4-2_2.4.47+dfsg-3+deb10u7_amd64.deb ...
#6 91.48 Unpacking libldap-2.4-2:amd64 (2.4.47+dfsg-3+deb10u7) ...
#6 91.76 Selecting previously unselected package libnpth0:amd64.
#6 91.77 Preparing to unpack .../099-libnpth0_1.6-1_amd64.deb ...
#6 91.80 Unpacking libnpth0:amd64 (1.6-1) ...
#6 92.07 Selecting previously unselected package dirmngr.
#6 92.08 Preparing to unpack .../100-dirmngr_2.2.12-1+deb10u2_amd64.deb ...
#6 92.12 Unpacking dirmngr (2.2.12-1+deb10u2) ...
#6 92.35 Selecting previously unselected package gnupg-l10n.
#6 92.35 Preparing to unpack .../101-gnupg-l10n_2.2.12-1+deb10u2_all.deb ...
#6 92.39 Unpacking gnupg-l10n (2.2.12-1+deb10u2) ...
#6 92.64 Selecting previously unselected package gnupg-utils.
#6 92.65 Preparing to unpack .../102-gnupg-utils_2.2.12-1+deb10u2_amd64.deb ...
#6 92.68 Unpacking gnupg-utils (2.2.12-1+deb10u2) ...
#6 92.92 Selecting previously unselected package gpg.
#6 92.92 Preparing to unpack .../103-gpg_2.2.12-1+deb10u2_amd64.deb ...
#6 92.96 Unpacking gpg (2.2.12-1+deb10u2) ...
#6 93.24 Selecting previously unselected package pinentry-curses.
#6 93.24 Preparing to unpack .../104-pinentry-curses_1.1.0-2_amd64.deb ...
#6 93.28 Unpacking pinentry-curses (1.1.0-2) ...
#6 93.52 Selecting previously unselected package gpg-agent.
#6 93.52 Preparing to unpack .../105-gpg-agent_2.2.12-1+deb10u2_amd64.deb ...
#6 93.56 Unpacking gpg-agent (2.2.12-1+deb10u2) ...
#6 93.80 Selecting previously unselected package gpg-wks-client.
#6 93.80 Preparing to unpack .../106-gpg-wks-client_2.2.12-1+deb10u2_amd64.deb ...
#6 93.84 Unpacking gpg-wks-client (2.2.12-1+deb10u2) ...
#6 94.07 Selecting previously unselected package gpg-wks-server.
#6 94.07 Preparing to unpack .../107-gpg-wks-server_2.2.12-1+deb10u2_amd64.deb ...
#6 94.10 Unpacking gpg-wks-server (2.2.12-1+deb10u2) ...
#6 94.32 Selecting previously unselected package gpgsm.
#6 94.32 Preparing to unpack .../108-gpgsm_2.2.12-1+deb10u2_amd64.deb ...
#6 94.36 Unpacking gpgsm (2.2.12-1+deb10u2) ...
#6 94.59 Selecting previously unselected package gnupg.
#6 94.60 Preparing to unpack .../109-gnupg_2.2.12-1+deb10u2_all.deb ...
#6 94.67 Unpacking gnupg (2.2.12-1+deb10u2) ...
#6 94.90 Selecting previously unselected package libfile-which-perl.
#6 94.90 Preparing to unpack .../110-libfile-which-perl_1.23-1_all.deb ...
#6 94.94 Unpacking libfile-which-perl (1.23-1) ...
#6 95.17 Selecting previously unselected package libfile-homedir-perl.
#6 95.18 Preparing to unpack .../111-libfile-homedir-perl_1.004-1_all.deb ...
#6 95.21 Unpacking libfile-homedir-perl (1.004-1) ...
#6 95.42 Selecting previously unselected package libio-pty-perl.
#6 95.42 Preparing to unpack .../112-libio-pty-perl_1%3a1.08-1.1+b5_amd64.deb ...
#6 95.46 Unpacking libio-pty-perl (1:1.08-1.1+b5) ...
#6 95.69 Selecting previously unselected package libipc-run-perl.
#6 95.69 Preparing to unpack .../113-libipc-run-perl_20180523.0-1_all.deb ...
#6 95.72 Unpacking libipc-run-perl (20180523.0-1) ...
#6 95.93 Selecting previously unselected package libclass-method-modifiers-perl.
#6 95.93 Preparing to unpack .../114-libclass-method-modifiers-perl_2.12-1_all.deb ...
#6 95.98 Unpacking libclass-method-modifiers-perl (2.12-1) ...
#6 96.18 Selecting previously unselected package libsub-exporter-progressive-perl.
#6 96.18 Preparing to unpack .../115-libsub-exporter-progressive-perl_0.001013-1_all.deb ...
#6 96.23 Unpacking libsub-exporter-progressive-perl (0.001013-1) ...
#6 96.42 Selecting previously unselected package libdevel-globaldestruction-perl.
#6 96.42 Preparing to unpack .../116-libdevel-globaldestruction-perl_0.14-1_all.deb ...
#6 96.45 Unpacking libdevel-globaldestruction-perl (0.14-1) ...
#6 96.65 Selecting previously unselected package libb-hooks-op-check-perl.
#6 96.65 Preparing to unpack .../117-libb-hooks-op-check-perl_0.22-1+b1_amd64.deb ...
#6 96.68 Unpacking libb-hooks-op-check-perl (0.22-1+b1) ...
#6 96.90 Selecting previously unselected package libdynaloader-functions-perl.
#6 96.90 Preparing to unpack .../118-libdynaloader-functions-perl_0.003-1_all.deb ...
#6 96.93 Unpacking libdynaloader-functions-perl (0.003-1) ...
#6 97.16 Selecting previously unselected package libdevel-callchecker-perl.
#6 97.16 Preparing to unpack .../119-libdevel-callchecker-perl_0.008-1_amd64.deb ...
#6 97.20 Unpacking libdevel-callchecker-perl (0.008-1) ...
#6 97.39 Selecting previously unselected package libparams-classify-perl.
#6 97.39 Preparing to unpack .../120-libparams-classify-perl_0.015-1+b1_amd64.deb ...
#6 97.42 Unpacking libparams-classify-perl (0.015-1+b1) ...
#6 97.65 Selecting previously unselected package libmodule-runtime-perl.
#6 97.66 Preparing to unpack .../121-libmodule-runtime-perl_0.016-1_all.deb ...
#6 97.69 Unpacking libmodule-runtime-perl (0.016-1) ...
#6 97.89 Selecting previously unselected package libimport-into-perl.
#6 97.90 Preparing to unpack .../122-libimport-into-perl_1.002005-1_all.deb ...
#6 97.93 Unpacking libimport-into-perl (1.002005-1) ...
#6 98.18 Selecting previously unselected package librole-tiny-perl.
#6 98.18 Preparing to unpack .../123-librole-tiny-perl_2.000006-1_all.deb ...
#6 98.22 Unpacking librole-tiny-perl (2.000006-1) ...
#6 98.41 Selecting previously unselected package libstrictures-perl.
#6 98.41 Preparing to unpack .../124-libstrictures-perl_2.000005-1_all.deb ...
#6 98.46 Unpacking libstrictures-perl (2.000005-1) ...
#6 98.67 Selecting previously unselected package libsub-quote-perl.
#6 98.68 Preparing to unpack .../125-libsub-quote-perl_2.005001-1_all.deb ...
#6 98.71 Unpacking libsub-quote-perl (2.005001-1) ...
#6 98.91 Selecting previously unselected package libmoo-perl.
#6 98.92 Preparing to unpack .../126-libmoo-perl_2.003004-2_all.deb ...
#6 98.96 Unpacking libmoo-perl (2.003004-2) ...
#6 99.16 Selecting previously unselected package libencode-locale-perl.
#6 99.16 Preparing to unpack .../127-libencode-locale-perl_1.05-1_all.deb ...
#6 99.19 Unpacking libencode-locale-perl (1.05-1) ...
#6 99.43 Selecting previously unselected package libtimedate-perl.
#6 99.43 Preparing to unpack .../128-libtimedate-perl_2.3000-2+deb10u1_all.deb ...
#6 99.47 Unpacking libtimedate-perl (2.3000-2+deb10u1) ...
#6 99.68 Selecting previously unselected package libhttp-date-perl.
#6 99.68 Preparing to unpack .../129-libhttp-date-perl_6.02-1_all.deb ...
#6 99.71 Unpacking libhttp-date-perl (6.02-1) ...
#6 99.92 Selecting previously unselected package libfile-listing-perl.
#6 99.92 Preparing to unpack .../130-libfile-listing-perl_6.04-1_all.deb ...
#6 99.95 Unpacking libfile-listing-perl (6.04-1) ...
#6 100.2 Selecting previously unselected package libhtml-tagset-perl.
#6 100.2 Preparing to unpack .../131-libhtml-tagset-perl_3.20-3_all.deb ...
#6 100.2 Unpacking libhtml-tagset-perl (3.20-3) ...
#6 100.4 Selecting previously unselected package liburi-perl.
#6 100.4 Preparing to unpack .../132-liburi-perl_1.76-1_all.deb ...
#6 100.4 Unpacking liburi-perl (1.76-1) ...
#6 100.7 Selecting previously unselected package libhtml-parser-perl.
#6 100.7 Preparing to unpack .../133-libhtml-parser-perl_3.72-3+b3_amd64.deb ...
#6 100.7 Unpacking libhtml-parser-perl (3.72-3+b3) ...
#6 100.9 Selecting previously unselected package libhtml-tree-perl.
#6 100.9 Preparing to unpack .../134-libhtml-tree-perl_5.07-2_all.deb ...
#6 100.9 Unpacking libhtml-tree-perl (5.07-2) ...
#6 101.2 Selecting previously unselected package libio-html-perl.
#6 101.2 Preparing to unpack .../135-libio-html-perl_1.001-1_all.deb ...
#6 101.2 Unpacking libio-html-perl (1.001-1) ...
#6 101.4 Selecting previously unselected package liblwp-mediatypes-perl.
#6 101.4 Preparing to unpack .../136-liblwp-mediatypes-perl_6.02-1_all.deb ...
#6 101.4 Unpacking liblwp-mediatypes-perl (6.02-1) ...
#6 101.7 Selecting previously unselected package libhttp-message-perl.
#6 101.7 Preparing to unpack .../137-libhttp-message-perl_6.18-1_all.deb ...
#6 101.7 Unpacking libhttp-message-perl (6.18-1) ...
#6 101.9 Selecting previously unselected package libhttp-cookies-perl.
#6 101.9 Preparing to unpack .../138-libhttp-cookies-perl_6.04-1_all.deb ...
#6 101.9 Unpacking libhttp-cookies-perl (6.04-1) ...
#6 102.2 Selecting previously unselected package libhttp-negotiate-perl.
#6 102.2 Preparing to unpack .../139-libhttp-negotiate-perl_6.01-1_all.deb ...
#6 102.2 Unpacking libhttp-negotiate-perl (6.01-1) ...
#6 102.4 Selecting previously unselected package perl-openssl-defaults:amd64.
#6 102.4 Preparing to unpack .../140-perl-openssl-defaults_3_amd64.deb ...
#6 102.5 Unpacking perl-openssl-defaults:amd64 (3) ...
#6 102.7 Selecting previously unselected package libnet-ssleay-perl.
#6 102.7 Preparing to unpack .../141-libnet-ssleay-perl_1.85-2+deb10u1_amd64.deb ...
#6 102.7 Unpacking libnet-ssleay-perl (1.85-2+deb10u1) ...
#6 102.9 Selecting previously unselected package libio-socket-ssl-perl.
#6 102.9 Preparing to unpack .../142-libio-socket-ssl-perl_2.060-3_all.deb ...
#6 103.0 Unpacking libio-socket-ssl-perl (2.060-3) ...
#6 103.2 Selecting previously unselected package libnet-http-perl.
#6 103.2 Preparing to unpack .../143-libnet-http-perl_6.18-1_all.deb ...
#6 103.2 Unpacking libnet-http-perl (6.18-1) ...
#6 103.5 Selecting previously unselected package liblwp-protocol-https-perl.
#6 103.5 Preparing to unpack .../144-liblwp-protocol-https-perl_6.07-2_all.deb ...
#6 103.5 Unpacking liblwp-protocol-https-perl (6.07-2) ...
#6 103.7 Selecting previously unselected package libtry-tiny-perl.
#6 103.7 Preparing to unpack .../145-libtry-tiny-perl_0.30-1_all.deb ...
#6 103.8 Unpacking libtry-tiny-perl (0.30-1) ...
#6 104.0 Selecting previously unselected package libwww-robotrules-perl.
#6 104.0 Preparing to unpack .../146-libwww-robotrules-perl_6.02-1_all.deb ...
#6 104.0 Unpacking libwww-robotrules-perl (6.02-1) ...
#6 104.3 Selecting previously unselected package libwww-perl.
#6 104.3 Preparing to unpack .../147-libwww-perl_6.36-2_all.deb ...
#6 104.3 Unpacking libwww-perl (6.36-2) ...
#6 104.6 Selecting previously unselected package patchutils.
#6 104.6 Preparing to unpack .../148-patchutils_0.3.4-2_amd64.deb ...
#6 104.6 Unpacking patchutils (0.3.4-2) ...
#6 104.8 Selecting previously unselected package wdiff.
#6 104.8 Preparing to unpack .../149-wdiff_1.2.2-2+b1_amd64.deb ...
#6 104.9 Unpacking wdiff (1.2.2-2+b1) ...
#6 105.2 Selecting previously unselected package devscripts.
#6 105.2 Preparing to unpack .../150-devscripts_2.19.5+deb10u1_amd64.deb ...
#6 105.3 Unpacking devscripts (2.19.5+deb10u1) ...
#6 105.6 Selecting previously unselected package dh-systemd.
#6 105.6 Preparing to unpack .../151-dh-systemd_12.1.1_all.deb ...
#6 105.6 Unpacking dh-systemd (12.1.1) ...
#6 105.9 Selecting previously unselected package libedit2:amd64.
#6 105.9 Preparing to unpack .../152-libedit2_3.1-20181209-1_amd64.deb ...
#6 105.9 Unpacking libedit2:amd64 (3.1-20181209-1) ...
#6 106.2 Selecting previously unselected package libllvm6.0:amd64.
#6 106.2 Preparing to unpack .../153-libllvm6.0_1%3a6.0.1-10_amd64.deb ...
#6 106.2 Unpacking libllvm6.0:amd64 (1:6.0.1-10) ...
#6 107.2 Selecting previously unselected package libclang1-6.0:amd64.
#6 107.2 Preparing to unpack .../154-libclang1-6.0_1%3a6.0.1-10_amd64.deb ...
#6 107.2 Unpacking libclang1-6.0:amd64 (1:6.0.1-10) ...
#6 107.8 Selecting previously unselected package doxygen.
#6 107.8 Preparing to unpack .../155-doxygen_1.8.13-10_amd64.deb ...
#6 107.8 Unpacking doxygen (1.8.13-10) ...
#6 108.2 Selecting previously unselected package equivs.
#6 108.2 Preparing to unpack .../156-equivs_2.2.0_all.deb ...
#6 108.3 Unpacking equivs (2.2.0) ...
#6 108.5 Selecting previously unselected package gcc-arm-none-eabi.
#6 108.5 Preparing to unpack .../157-gcc-arm-none-eabi_15%3a7-2018-q2-6_amd64.deb ...
#6 108.6 Unpacking gcc-arm-none-eabi (15:7-2018-q2-6) ...
#6 111.3 Selecting previously unselected package libnghttp2-14:amd64.
#6 111.3 Preparing to unpack .../158-libnghttp2-14_1.36.0-2+deb10u3_amd64.deb ...
#6 111.3 Unpacking libnghttp2-14:amd64 (1.36.0-2+deb10u3) ...
#6 111.6 Selecting previously unselected package librtmp1:amd64.
#6 111.6 Preparing to unpack .../159-librtmp1_2.4+20151223.gitfa8646d.1-2_amd64.deb ...
#6 111.7 Unpacking librtmp1:amd64 (2.4+20151223.gitfa8646d.1-2) ...
#6 111.9 Selecting previously unselected package libssh2-1:amd64.
#6 112.0 Preparing to unpack .../160-libssh2-1_1.8.0-2.1+deb10u1_amd64.deb ...
#6 112.0 Unpacking libssh2-1:amd64 (1.8.0-2.1+deb10u1) ...
#6 112.3 Selecting previously unselected package libcurl3-gnutls:amd64.
#6 112.3 Preparing to unpack .../161-libcurl3-gnutls_7.64.0-4+deb10u9_amd64.deb ...
#6 112.4 Unpacking libcurl3-gnutls:amd64 (7.64.0-4+deb10u9) ...
#6 112.6 Selecting previously unselected package liberror-perl.
#6 112.6 Preparing to unpack .../162-liberror-perl_0.17027-2_all.deb ...
#6 112.7 Unpacking liberror-perl (0.17027-2) ...
#6 112.9 Selecting previously unselected package git-man.
#6 112.9 Preparing to unpack .../163-git-man_1%3a2.20.1-2+deb10u9_all.deb ...
#6 112.9 Unpacking git-man (1:2.20.1-2+deb10u9) ...
#6 113.3 Selecting previously unselected package git.
#6 113.3 Preparing to unpack .../164-git_1%3a2.20.1-2+deb10u9_amd64.deb ...
#6 113.4 Unpacking git (1:2.20.1-2+deb10u9) ...
#6 113.9 Selecting previously unselected package python3-six.
#6 113.9 Preparing to unpack .../165-python3-six_1.12.0-1_all.deb ...
#6 114.0 Unpacking python3-six (1.12.0-1) ...
#6 114.2 Selecting previously unselected package python3-dateutil.
#6 114.2 Preparing to unpack .../166-python3-dateutil_2.7.3-3_all.deb ...
#6 114.3 Unpacking python3-dateutil (2.7.3-3) ...
#6 114.5 Selecting previously unselected package python3-pkg-resources.
#6 114.5 Preparing to unpack .../167-python3-pkg-resources_40.8.0-1_all.deb ...
#6 114.6 Unpacking python3-pkg-resources (40.8.0-1) ...
#6 115.0 Selecting previously unselected package git-buildpackage.
#6 115.0 Preparing to unpack .../168-git-buildpackage_0.9.14_all.deb ...
#6 115.0 Unpacking git-buildpackage (0.9.14) ...
#6 115.3 Selecting previously unselected package libmbedcrypto3:amd64.
#6 115.3 Preparing to unpack .../169-libmbedcrypto3_2.16.9-0~deb10u1_amd64.deb ...
#6 115.4 Unpacking libmbedcrypto3:amd64 (2.16.9-0~deb10u1) ...
#6 115.7 Selecting previously unselected package libmbedx509-0:amd64.
#6 115.7 Preparing to unpack .../170-libmbedx509-0_2.16.9-0~deb10u1_amd64.deb ...
#6 115.7 Unpacking libmbedx509-0:amd64 (2.16.9-0~deb10u1) ...
#6 116.0 Selecting previously unselected package libmbedtls12:amd64.
#6 116.0 Preparing to unpack .../171-libmbedtls12_2.16.9-0~deb10u1_amd64.deb ...
#6 116.0 Unpacking libmbedtls12:amd64 (2.16.9-0~deb10u1) ...
#6 117.5 Selecting previously unselected package libbctoolbox1:amd64.
#6 117.5 Preparing to unpack .../172-libbctoolbox1_0.6.0-2+b2_amd64.deb ...
#6 117.5 Unpacking libbctoolbox1:amd64 (0.6.0-2+b2) ...
#6 117.9 Selecting previously unselected package libbctoolbox-dev.
#6 117.9 Preparing to unpack .../173-libbctoolbox-dev_0.6.0-2+b2_amd64.deb ...
#6 118.0 Unpacking libbctoolbox-dev (0.6.0-2+b2) ...
#6 118.3 Selecting previously unselected package libbluetooth3:amd64.
#6 118.3 Preparing to unpack .../174-libbluetooth3_5.50-1.2~deb10u5_amd64.deb ...
#6 118.4 Unpacking libbluetooth3:amd64 (5.50-1.2~deb10u5) ...
#6 118.7 Selecting previously unselected package libdbi1:amd64.
#6 118.7 Preparing to unpack .../175-libdbi1_0.9.0-5_amd64.deb ...
#6 118.7 Unpacking libdbi1:amd64 (0.9.0-5) ...
#6 119.0 Selecting previously unselected package libdbd-sqlite3:amd64.
#6 119.0 Preparing to unpack .../176-libdbd-sqlite3_0.9.0-6+b1_amd64.deb ...
#6 119.0 Unpacking libdbd-sqlite3:amd64 (0.9.0-6+b1) ...
#6 119.3 Selecting previously unselected package libdbi-dev.
#6 119.3 Preparing to unpack .../177-libdbi-dev_0.9.0-5_amd64.deb ...
#6 119.4 Unpacking libdbi-dev (0.9.0-5) ...
#6 119.7 Selecting previously unselected package libdbus-1-3:amd64.
#6 119.7 Preparing to unpack .../178-libdbus-1-3_1.12.28-0+deb10u1_amd64.deb ...
#6 119.8 Unpacking libdbus-1-3:amd64 (1.12.28-0+deb10u1) ...
#6 ...

#8 [internal] load build context
#8 transferring context: 1.96kB done
#8 DONE 0.3s

#6 [2/6] RUN	APT-GET update && 	apt-get upgrade -y && 	apt-get install -y --no-install-recommends 		autoconf 		autoconf-archive 		autogen 		automake 		bison 		build-essential 		ca-certificates 		cppcheck 		dahdi-source 		debhelper 		devscripts 		dh-autoreconf 		dh-systemd 		doxygen 		equivs 		flex 		g++ 		gawk 		gcc 		gcc-arm-none-eabi 		git 		git-buildpackage 		gnupg 		libc-ares-dev 		libdbd-sqlite3 		libdbi-dev 		libfftw3-dev 		libgnutls28-dev 		libgps-dev 		libgsm1-dev 		libncurses5-dev 		libnewlib-arm-none-eabi 		libortp-dev 		libpcap-dev 		libpcsclite-dev 		libreadline-dev 		libsctp-dev 		libsofia-sip-ua-glib-dev 		libsqlite3-dev 		libssl-dev 		libtalloc-dev 		libtool 		libusb-1.0-0-dev 		libusb-dev 		make 		netcat-openbsd 		pkg-config 		sqlite3 		stow 		telnet 		tcpdump 		wget && 	apt-get clean
#6 120.1 Selecting previously unselected package libevent-2.1-6:amd64.
#6 120.1 Preparing to unpack .../179-libevent-2.1-6_2.1.8-stable-4_amd64.deb ...
#6 120.2 Unpacking libevent-2.1-6:amd64 (2.1.8-stable-4) ...
#6 120.7 Selecting previously unselected package libffi-dev:amd64.
#6 120.7 Preparing to unpack .../180-libffi-dev_3.2.1-9_amd64.deb ...
#6 120.7 Unpacking libffi-dev:amd64 (3.2.1-9) ...
#6 121.0 Selecting previously unselected package libfftw3-double3:amd64.
#6 121.0 Preparing to unpack .../181-libfftw3-double3_3.3.8-2_amd64.deb ...
#6 121.1 Unpacking libfftw3-double3:amd64 (3.3.8-2) ...
#6 121.5 Selecting previously unselected package libfftw3-long3:amd64.
#6 121.5 Preparing to unpack .../182-libfftw3-long3_3.3.8-2_amd64.deb ...
#6 121.5 Unpacking libfftw3-long3:amd64 (3.3.8-2) ...
#6 122.0 Selecting previously unselected package libfftw3-quad3:amd64.
#6 122.0 Preparing to unpack .../183-libfftw3-quad3_3.3.8-2_amd64.deb ...
#6 122.0 Unpacking libfftw3-quad3:amd64 (3.3.8-2) ...
#6 122.4 Selecting previously unselected package libfftw3-single3:amd64.
#6 122.4 Preparing to unpack .../184-libfftw3-single3_3.3.8-2_amd64.deb ...
#6 122.4 Unpacking libfftw3-single3:amd64 (3.3.8-2) ...
#6 122.8 Selecting previously unselected package libfftw3-bin.
#6 122.8 Preparing to unpack .../185-libfftw3-bin_3.3.8-2_amd64.deb ...
#6 122.8 Unpacking libfftw3-bin (3.3.8-2) ...
#6 123.1 Selecting previously unselected package libfftw3-dev:amd64.
#6 123.1 Preparing to unpack .../186-libfftw3-dev_3.3.8-2_amd64.deb ...
#6 123.1 Unpacking libfftw3-dev:amd64 (3.3.8-2) ...
#6 123.5 Selecting previously unselected package libglib2.0-data.
#6 123.5 Preparing to unpack .../187-libglib2.0-data_2.58.3-2+deb10u6_all.deb ...
#6 123.5 Unpacking libglib2.0-data (2.58.3-2+deb10u6) ...
#6 123.9 Selecting previously unselected package libglib2.0-bin.
#6 123.9 Preparing to unpack .../188-libglib2.0-bin_2.58.3-2+deb10u6_amd64.deb ...
#6 123.9 Unpacking libglib2.0-bin (2.58.3-2+deb10u6) ...
#6 124.2 Selecting previously unselected package python3-lib2to3.
#6 124.2 Preparing to unpack .../189-python3-lib2to3_3.7.3-1_all.deb ...
#6 124.3 Unpacking python3-lib2to3 (3.7.3-1) ...
#6 124.9 Selecting previously unselected package python3-distutils.
#6 124.9 Preparing to unpack .../190-python3-distutils_3.7.3-1_all.deb ...
#6 124.9 Unpacking python3-distutils (3.7.3-1) ...
#6 125.3 Selecting previously unselected package libglib2.0-dev-bin.
#6 125.3 Preparing to unpack .../191-libglib2.0-dev-bin_2.58.3-2+deb10u6_amd64.deb ...
#6 125.4 Unpacking libglib2.0-dev-bin (2.58.3-2+deb10u6) ...
#6 125.6 Selecting previously unselected package uuid-dev:amd64.
#6 125.6 Preparing to unpack .../192-uuid-dev_2.33.1-0.1+deb10u1_amd64.deb ...
#6 125.8 Unpacking uuid-dev:amd64 (2.33.1-0.1+deb10u1) ...
#6 126.1 Selecting previously unselected package libblkid-dev:amd64.
#6 126.1 Preparing to unpack .../193-libblkid-dev_2.33.1-0.1+deb10u1_amd64.deb ...
#6 126.2 Unpacking libblkid-dev:amd64 (2.33.1-0.1+deb10u1) ...
#6 126.4 Selecting previously unselected package libmount-dev:amd64.
#6 126.4 Preparing to unpack .../194-libmount-dev_2.33.1-0.1+deb10u1_amd64.deb ...
#6 126.5 Unpacking libmount-dev:amd64 (2.33.1-0.1+deb10u1) ...
#6 126.8 Selecting previously unselected package libpcre16-3:amd64.
#6 126.8 Preparing to unpack .../195-libpcre16-3_2%3a8.39-12_amd64.deb ...
#6 126.8 Unpacking libpcre16-3:amd64 (2:8.39-12) ...
#6 127.3 Selecting previously unselected package libpcre32-3:amd64.
#6 127.3 Preparing to unpack .../196-libpcre32-3_2%3a8.39-12_amd64.deb ...
#6 127.3 Unpacking libpcre32-3:amd64 (2:8.39-12) ...
#6 127.6 Selecting previously unselected package libpcrecpp0v5:amd64.
#6 127.6 Preparing to unpack .../197-libpcrecpp0v5_2%3a8.39-12_amd64.deb ...
#6 127.7 Unpacking libpcrecpp0v5:amd64 (2:8.39-12) ...
#6 127.9 Selecting previously unselected package libpcre3-dev:amd64.
#6 128.0 Preparing to unpack .../198-libpcre3-dev_2%3a8.39-12_amd64.deb ...
#6 128.0 Unpacking libpcre3-dev:amd64 (2:8.39-12) ...
#6 128.2 Selecting previously unselected package libsepol1-dev:amd64.
#6 128.2 Preparing to unpack .../199-libsepol1-dev_2.8-1_amd64.deb ...
#6 128.3 Unpacking libsepol1-dev:amd64 (2.8-1) ...
#6 128.6 Selecting previously unselected package libselinux1-dev:amd64.
#6 128.6 Preparing to unpack .../200-libselinux1-dev_2.8-1+b1_amd64.deb ...
#6 128.6 Unpacking libselinux1-dev:amd64 (2.8-1+b1) ...
#6 129.0 Selecting previously unselected package pkg-config.
#6 129.0 Preparing to unpack .../201-pkg-config_0.29-6_amd64.deb ...
#6 129.1 Unpacking pkg-config (0.29-6) ...
#6 129.4 Selecting previously unselected package zlib1g-dev:amd64.
#6 129.4 Preparing to unpack .../202-zlib1g-dev_1%3a1.2.11.dfsg-1+deb10u2_amd64.deb ...
#6 129.5 Unpacking zlib1g-dev:amd64 (1:1.2.11.dfsg-1+deb10u2) ...
#6 130.0 Selecting previously unselected package libglib2.0-dev:amd64.
#6 130.0 Preparing to unpack .../203-libglib2.0-dev_2.58.3-2+deb10u6_amd64.deb ...
#6 130.0 Unpacking libglib2.0-dev:amd64 (2.58.3-2+deb10u6) ...
#6 130.4 Selecting previously unselected package libgmpxx4ldbl:amd64.
#6 130.4 Preparing to unpack .../204-libgmpxx4ldbl_2%3a6.1.2+dfsg-4+deb10u1_amd64.deb ...
#6 130.4 Unpacking libgmpxx4ldbl:amd64 (2:6.1.2+dfsg-4+deb10u1) ...
#6 130.9 Selecting previously unselected package libgmp-dev:amd64.
#6 130.9 Preparing to unpack .../205-libgmp-dev_2%3a6.1.2+dfsg-4+deb10u1_amd64.deb ...
#6 131.0 Unpacking libgmp-dev:amd64 (2:6.1.2+dfsg-4+deb10u1) ...
#6 131.5 Selecting previously unselected package libunbound8:amd64.
#6 131.5 Preparing to unpack .../206-libunbound8_1.9.0-2+deb10u4_amd64.deb ...
#6 131.5 Unpacking libunbound8:amd64 (1.9.0-2+deb10u4) ...
#6 132.0 Selecting previously unselected package libgnutls-dane0:amd64.
#6 132.0 Preparing to unpack .../207-libgnutls-dane0_3.6.7-4+deb10u12_amd64.deb ...
#6 132.0 Unpacking libgnutls-dane0:amd64 (3.6.7-4+deb10u12) ...
#6 132.4 Selecting previously unselected package libgnutlsxx28:amd64.
#6 132.4 Preparing to unpack .../208-libgnutlsxx28_3.6.7-4+deb10u12_amd64.deb ...
#6 132.4 Unpacking libgnutlsxx28:amd64 (3.6.7-4+deb10u12) ...
#6 132.9 Selecting previously unselected package libidn2-dev:amd64.
#6 132.9 Preparing to unpack .../209-libidn2-dev_2.0.5-1+deb10u1_amd64.deb ...
#6 132.9 Unpacking libidn2-dev:amd64 (2.0.5-1+deb10u1) ...
#6 133.2 Selecting previously unselected package libp11-kit-dev:amd64.
#6 133.2 Preparing to unpack .../210-libp11-kit-dev_0.23.15-2+deb10u1_amd64.deb ...
#6 133.4 Unpacking libp11-kit-dev:amd64 (0.23.15-2+deb10u1) ...
#6 133.7 Selecting previously unselected package libtasn1-6-dev:amd64.
#6 133.7 Preparing to unpack .../211-libtasn1-6-dev_4.13-3+deb10u1_amd64.deb ...
#6 133.7 Unpacking libtasn1-6-dev:amd64 (4.13-3+deb10u1) ...
#6 133.9 Selecting previously unselected package nettle-dev:amd64.
#6 133.9 Preparing to unpack .../212-nettle-dev_3.4.1-1+deb10u1_amd64.deb ...
#6 134.0 Unpacking nettle-dev:amd64 (3.4.1-1+deb10u1) ...
#6 134.3 Selecting previously unselected package libgnutls28-dev:amd64.
#6 134.3 Preparing to unpack .../213-libgnutls28-dev_3.6.7-4+deb10u12_amd64.deb ...
#6 134.3 Unpacking libgnutls28-dev:amd64 (3.6.7-4+deb10u12) ...
#6 134.9 Selecting previously unselected package libgps23:amd64.
#6 134.9 Preparing to unpack .../214-libgps23_3.17-7_amd64.deb ...
#6 134.9 Unpacking libgps23:amd64 (3.17-7) ...
#6 135.2 Selecting previously unselected package libgps-dev.
#6 135.2 Preparing to unpack .../215-libgps-dev_3.17-7_amd64.deb ...
#6 135.2 Unpacking libgps-dev (3.17-7) ...
#6 136.0 Selecting previously unselected package libgsm1:amd64.
#6 136.0 Preparing to unpack .../216-libgsm1_1.0.18-2_amd64.deb ...
#6 136.0 Unpacking libgsm1:amd64 (1.0.18-2) ...
#6 136.4 Selecting previously unselected package libgsm1-dev:amd64.
#6 136.4 Preparing to unpack .../217-libgsm1-dev_1.0.18-2_amd64.deb ...
#6 136.7 Unpacking libgsm1-dev:amd64 (1.0.18-2) ...
#6 136.9 Selecting previously unselected package libncurses-dev:amd64.
#6 137.0 Preparing to unpack .../218-libncurses-dev_6.1+20181013-2+deb10u5_amd64.deb ...
#6 137.0 Unpacking libncurses-dev:amd64 (6.1+20181013-2+deb10u5) ...
#6 137.3 Selecting previously unselected package libncurses5-dev:amd64.
#6 137.3 Preparing to unpack .../219-libncurses5-dev_6.1+20181013-2+deb10u5_amd64.deb ...
#6 138.1 Unpacking libncurses5-dev:amd64 (6.1+20181013-2+deb10u5) ...
#6 138.8 Selecting previously unselected package libnewlib-dev.
#6 138.8 Preparing to unpack .../220-libnewlib-dev_3.1.0.20181231-1_all.deb ...
#6 138.8 Unpacking libnewlib-dev (3.1.0.20181231-1) ...
#6 139.4 Selecting previously unselected package libnewlib-arm-none-eabi.
#6 139.4 Preparing to unpack .../221-libnewlib-arm-none-eabi_3.1.0.20181231-1_all.deb ...
#6 139.4 Unpacking libnewlib-arm-none-eabi (3.1.0.20181231-1) ...
#6 141.6 Selecting previously unselected package libortp13:amd64.
#6 141.6 Preparing to unpack .../222-libortp13_1%3a1.0.2-1_amd64.deb ...
#6 141.6 Unpacking libortp13:amd64 (1:1.0.2-1) ...
#6 141.9 Selecting previously unselected package libortp-dev:amd64.
#6 141.9 Preparing to unpack .../223-libortp-dev_1%3a1.0.2-1_amd64.deb ...
#6 142.0 Unpacking libortp-dev:amd64 (1:1.0.2-1) ...
#6 142.3 Selecting previously unselected package libpcap0.8:amd64.
#6 142.3 Preparing to unpack .../224-libpcap0.8_1.8.1-6+deb10u1_amd64.deb ...
#6 142.4 Unpacking libpcap0.8:amd64 (1.8.1-6+deb10u1) ...
#6 142.7 Selecting previously unselected package libpcap0.8-dev:amd64.
#6 142.8 Preparing to unpack .../225-libpcap0.8-dev_1.8.1-6+deb10u1_amd64.deb ...
#6 142.8 Unpacking libpcap0.8-dev:amd64 (1.8.1-6+deb10u1) ...
#6 143.1 Selecting previously unselected package libpcap-dev:amd64.
#6 143.1 Preparing to unpack .../226-libpcap-dev_1.8.1-6+deb10u1_amd64.deb ...
#6 143.2 Unpacking libpcap-dev:amd64 (1.8.1-6+deb10u1) ...
#6 143.7 Selecting previously unselected package libpcsclite1:amd64.
#6 143.7 Preparing to unpack .../227-libpcsclite1_1.8.24-1_amd64.deb ...
#6 143.8 Unpacking libpcsclite1:amd64 (1.8.24-1) ...
#6 144.1 Selecting previously unselected package libpcsclite-dev.
#6 144.1 Preparing to unpack .../228-libpcsclite-dev_1.8.24-1_amd64.deb ...
#6 144.2 Unpacking libpcsclite-dev (1.8.24-1) ...
#6 144.5 Selecting previously unselected package libreadline-dev:amd64.
#6 144.5 Preparing to unpack .../229-libreadline-dev_7.0-5_amd64.deb ...
#6 144.5 Unpacking libreadline-dev:amd64 (7.0-5) ...
#6 145.6 Selecting previously unselected package libsctp1:amd64.
#6 145.6 Preparing to unpack .../230-libsctp1_1.0.18+dfsg-1_amd64.deb ...
#6 145.7 Unpacking libsctp1:amd64 (1.0.18+dfsg-1) ...
#6 146.2 Selecting previously unselected package libsctp-dev:amd64.
#6 146.2 Preparing to unpack .../231-libsctp-dev_1.0.18+dfsg-1_amd64.deb ...
#6 146.3 Unpacking libsctp-dev:amd64 (1.0.18+dfsg-1) ...
#6 146.6 Selecting previously unselected package libsofia-sip-ua0.
#6 146.6 Preparing to unpack .../232-libsofia-sip-ua0_1.12.11+20110422.1-2.1+deb10u4_amd64.deb ...
#6 146.6 Unpacking libsofia-sip-ua0 (1.12.11+20110422.1-2.1+deb10u4) ...
#6 147.1 Selecting previously unselected package libsofia-sip-ua-dev.
#6 147.1 Preparing to unpack .../233-libsofia-sip-ua-dev_1.12.11+20110422.1-2.1+deb10u4_amd64.deb ...
#6 147.2 Unpacking libsofia-sip-ua-dev (1.12.11+20110422.1-2.1+deb10u4) ...
#6 147.9 Selecting previously unselected package libsofia-sip-ua-glib3.
#6 149.2 Preparing to unpack .../234-libsofia-sip-ua-glib3_1.12.11+20110422.1-2.1+deb10u4_amd64.deb ...
#6 150.2 Unpacking libsofia-sip-ua-glib3 (1.12.11+20110422.1-2.1+deb10u4) ...
#6 150.6 Selecting previously unselected package libsofia-sip-ua-glib-dev.
#6 150.6 Preparing to unpack .../235-libsofia-sip-ua-glib-dev_1.12.11+20110422.1-2.1+deb10u4_amd64.deb ...
#6 150.7 Unpacking libsofia-sip-ua-glib-dev (1.12.11+20110422.1-2.1+deb10u4) ...
#6 151.0 Selecting previously unselected package libsqlite3-dev:amd64.
#6 151.0 Preparing to unpack .../236-libsqlite3-dev_3.27.2-3+deb10u2_amd64.deb ...
#6 151.0 Unpacking libsqlite3-dev:amd64 (3.27.2-3+deb10u2) ...
#6 151.5 Selecting previously unselected package libssl-dev:amd64.
#6 151.5 Preparing to unpack .../237-libssl-dev_1.1.1n-0+deb10u6_amd64.deb ...
#6 151.5 Unpacking libssl-dev:amd64 (1.1.1n-0+deb10u6) ...
#6 152.1 Selecting previously unselected package libtalloc2:amd64.
#6 152.1 Preparing to unpack .../238-libtalloc2_2.1.14-2_amd64.deb ...
#6 152.2 Unpacking libtalloc2:amd64 (2.1.14-2) ...
#6 152.5 Selecting previously unselected package libtalloc-dev:amd64.
#6 152.5 Preparing to unpack .../239-libtalloc-dev_2.1.14-2_amd64.deb ...
#6 152.5 Unpacking libtalloc-dev:amd64 (2.1.14-2) ...
#6 153.0 Selecting previously unselected package libusb-0.1-4:amd64.
#6 153.0 Preparing to unpack .../240-libusb-0.1-4_2%3a0.1.12-32_amd64.deb ...
#6 153.1 Unpacking libusb-0.1-4:amd64 (2:0.1.12-32) ...
#6 153.4 Selecting previously unselected package libusb-1.0-0:amd64.
#6 153.4 Preparing to unpack .../241-libusb-1.0-0_2%3a1.0.22-2_amd64.deb ...
#6 153.5 Unpacking libusb-1.0-0:amd64 (2:1.0.22-2) ...
#6 153.8 Selecting previously unselected package libusb-1.0-0-dev:amd64.
#6 153.8 Preparing to unpack .../242-libusb-1.0-0-dev_2%3a1.0.22-2_amd64.deb ...
#6 153.8 Unpacking libusb-1.0-0-dev:amd64 (2:1.0.22-2) ...
#6 154.5 Selecting previously unselected package libusb-dev.
#6 154.5 Preparing to unpack .../243-libusb-dev_2%3a0.1.12-32_amd64.deb ...
#6 154.6 Unpacking libusb-dev (2:0.1.12-32) ...
#6 154.9 Selecting previously unselected package netcat-openbsd.
#6 154.9 Preparing to unpack .../244-netcat-openbsd_1.195-2_amd64.deb ...
#6 154.9 Unpacking netcat-openbsd (1.195-2) ...
#6 155.4 Selecting previously unselected package sqlite3.
#6 155.4 Preparing to unpack .../245-sqlite3_3.27.2-3+deb10u2_amd64.deb ...
#6 155.4 Unpacking sqlite3 (3.27.2-3+deb10u2) ...
#6 155.8 Selecting previously unselected package stow.
#6 155.8 Preparing to unpack .../246-stow_2.2.2-1_all.deb ...
#6 155.8 Unpacking stow (2.2.2-1) ...
#6 156.1 Selecting previously unselected package tcpdump.
#6 156.1 Preparing to unpack .../247-tcpdump_4.9.3-1~deb10u2_amd64.deb ...
#6 156.2 Unpacking tcpdump (4.9.3-1~deb10u2) ...
#6 156.5 Selecting previously unselected package libc-ares2:amd64.
#6 156.5 Preparing to unpack .../248-libc-ares2_1.14.0-1+deb10u4_amd64.deb ...
#6 156.6 Unpacking libc-ares2:amd64 (1.14.0-1+deb10u4) ...
#6 157.2 Selecting previously unselected package libc-ares-dev:amd64.
#6 157.2 Preparing to unpack .../249-libc-ares-dev_1.14.0-1+deb10u4_amd64.deb ...
#6 157.3 Unpacking libc-ares-dev:amd64 (1.14.0-1+deb10u4) ...
#6 157.5 Setting up perl-modules-5.28 (5.28.1-6+deb10u1) ...
#6 157.7 Setting up libksba8:amd64 (1.3.5-2+deb10u2) ...
#6 158.0 Setting up libpcrecpp0v5:amd64 (2:8.39-12) ...
#6 158.2 Setting up libpipeline1:amd64 (1.5.1-2) ...
#6 158.3 Setting up libtext-charwidth-perl (0.04-7.1+b1) ...
#6 158.4 Setting up libxapian30:amd64 (1.4.11-1+deb10u1) ...
#6 158.6 Setting up wdiff (1.2.2-2+b1) ...
#6 158.8 Setting up lsb-base (10.2019051400) ...
#6 159.4 Setting up libkeyutils1:amd64 (1.6-6) ...
#6 159.5 Setting up libpsl5:amd64 (0.20.2-2) ...
#6 159.6 Setting up binutils-arm-none-eabi (2.31.1-12+11) ...
#6 159.7 Setting up libgnutls-openssl27:amd64 (3.6.7-4+deb10u12) ...
#6 159.9 Setting up mime-support (3.62) ...
#6 160.2 Setting up libdbi1:amd64 (0.9.0-5) ...
#6 160.3 Setting up libpcre16-3:amd64 (2:8.39-12) ...
#6 160.5 Setting up libbison-dev:amd64 (2:3.3.2.dfsg-1) ...
#6 160.6 Setting up libmagic-mgc (1:5.35-4+deb10u2) ...
#6 160.8 Setting up libgsm1:amd64 (1.0.18-2) ...
#6 161.0 Setting up gawk (1:4.2.1+dfsg-1) ...
#6 161.3 Setting up libgc1c2:amd64 (1:7.6.4-0.4) ...
#6 161.4 Setting up libglib2.0-0:amd64 (2.58.3-2+deb10u6) ...
#6 161.5 No schema files found: doing nothing.
#6 161.5 Setting up libsqlite3-0:amd64 (3.27.2-3+deb10u2) ...
#6 161.6 Setting up binutils-common:amd64 (2.31.1-16) ...
#6 162.3 Setting up libnghttp2-14:amd64 (1.36.0-2+deb10u3) ...
#6 162.5 Setting up libmagic1:amd64 (1:5.35-4+deb10u2) ...
#6 162.7 Setting up libsepol1-dev:amd64 (2.8-1) ...
#6 162.8 Setting up perl-openssl-defaults:amd64 (3) ...
#6 163.1 Setting up linux-libc-dev:amd64 (4.19.316-1) ...
#6 163.4 Setting up gettext-base (0.19.8.1-9) ...
#6 163.5 Setting up m4 (1.4.18-2) ...
#6 163.6 Setting up libtinyxml2-6a:amd64 (7.0.0+dfsg-1) ...
#6 163.8 Setting up libnpth0:amd64 (1.6-1) ...
#6 164.2 Setting up autoconf-archive (20180313-1) ...
#6 164.8 Setting up libc-ares2:amd64 (1.14.0-1+deb10u4) ...
#6 164.9 Setting up file (1:5.35-4+deb10u2) ...
#6 165.1 Setting up libassuan0:amd64 (2.5.2-1) ...
#6 165.2 Setting up libgomp1:amd64 (8.3.0-6) ...
#6 165.8 Setting up bzip2 (1.0.6-9.2~deb10u2) ...
#6 165.9 Setting up libffi-dev:amd64 (3.2.1-9) ...
#6 166.1 Setting up libopts25:amd64 (1:5.18.12-4) ...
#6 166.2 Setting up libldap-common (2.4.47+dfsg-3+deb10u7) ...
#6 166.4 Setting up libtext-wrapi18n-perl (0.06-7.1) ...
#6 166.8 Setting up libicu63:amd64 (63.1-6+deb10u3) ...
#6 166.9 Setting up libfakeroot:amd64 (1.23-1) ...
#6 167.1 Setting up libusb-0.1-4:amd64 (2:0.1.12-32) ...
#6 167.4 Setting up libkrb5support0:amd64 (1.17-3+deb10u6) ...
#6 167.5 Setting up libsasl2-modules-db:amd64 (2.1.27+dfsg-1+deb10u2) ...
#6 167.7 Setting up fakeroot (1.23-1) ...
#6 167.8 update-alternatives: using /usr/bin/fakeroot-sysv to provide /usr/bin/fakeroot (fakeroot) in auto mode
#6 168.0 Setting up libtalloc2:amd64 (2.1.14-2) ...
#6 168.2 Setting up libasan5:amd64 (8.3.0-6) ...
#6 168.3 Setting up autotools-dev (20180224.1) ...
#6 168.5 Setting up libglib2.0-data (2.58.3-2+deb10u6) ...
#6 168.6 Setting up libgmpxx4ldbl:amd64 (2:6.1.2+dfsg-4+deb10u1) ...
#6 168.8 Setting up libpcap0.8:amd64 (1.8.1-6+deb10u1) ...
#6 169.0 Setting up make (4.2.1-1.2) ...
#6 169.1 Setting up gnupg-l10n (2.2.12-1+deb10u2) ...
#6 169.3 Setting up librtmp1:amd64 (2.4+20151223.gitfa8646d.1-2) ...
#6 169.4 Setting up libncurses6:amd64 (6.1+20181013-2+deb10u5) ...
#6 169.5 Setting up libdbus-1-3:amd64 (1.12.28-0+deb10u1) ...
#6 169.7 Setting up xz-utils (5.2.4-1+deb10u1) ...
#6 169.8 update-alternatives: using /usr/bin/xz to provide /usr/bin/lzma (lzma) in auto mode
#6 169.8 Setting up libnewlib-dev (3.1.0.20181231-1) ...
#6 170.0 Setting up libquadmath0:amd64 (8.3.0-6) ...
#6 170.1 Setting up libgsm1-dev:amd64 (1.0.18-2) ...
#6 170.2 Setting up libssl-dev:amd64 (1.1.1n-0+deb10u6) ...
#6 170.4 Setting up libpcre32-3:amd64 (2:8.39-12) ...
#6 170.8 Setting up libmpc3:amd64 (1.1.0-1) ...
#6 170.9 Setting up libc-ares-dev:amd64 (1.14.0-1+deb10u4) ...
#6 171.1 Setting up libatomic1:amd64 (8.3.0-6) ...
#6 171.2 Setting up patch (2.7.6-3+deb10u1) ...
#6 171.3 Setting up autopoint (0.19.8.1-9) ...
#6 171.4 Setting up libgnutlsxx28:amd64 (3.6.7-4+deb10u12) ...
#6 171.6 Setting up libpcsclite1:amd64 (1.8.24-1) ...
#6 171.9 Setting up libpcre2-8-0:amd64 (10.32-5+deb10u1) ...
#6 172.1 Setting up libpcsclite-dev (1.8.24-1) ...
#6 172.2 Setting up libk5crypto3:amd64 (1.17-3+deb10u6) ...
#6 172.3 Setting up libltdl7:amd64 (2.4.6-9) ...
#6 172.5 Setting up libfftw3-double3:amd64 (3.3.8-2) ...
#6 172.7 Setting up libidn2-dev:amd64 (2.0.5-1+deb10u1) ...
#6 173.4 Setting up libnewlib-arm-none-eabi (3.1.0.20181231-1) ...
#6 173.7 Setting up libsasl2-2:amd64 (2.1.27+dfsg-1+deb10u2) ...
#6 173.8 Setting up libevent-2.1-6:amd64 (2.1.8-stable-4) ...
#6 174.0 Setting up libmpx2:amd64 (8.3.0-6) ...
#6 174.1 Setting up libubsan1:amd64 (8.3.0-6) ...
#6 174.3 Setting up libisl19:amd64 (0.20-2) ...
#6 174.4 Setting up dwz (0.12-3) ...
#6 174.6 Setting up libsctp1:amd64 (1.0.18+dfsg-1) ...
#6 174.7 Setting up sensible-utils (0.0.12) ...
#6 174.9 Setting up libbluetooth3:amd64 (5.50-1.2~deb10u5) ...
#6 175.0 Setting up libuchardet0:amd64 (0.0.6-3) ...
#6 175.1 Setting up bison (2:3.3.2.dfsg-1) ...
#6 175.2 update-alternatives: using /usr/bin/bison.yacc to provide /usr/bin/yacc (yacc) in auto mode
#6 175.3 Setting up gpgconf (2.2.12-1+deb10u2) ...
#6 175.5 Setting up libmbedcrypto3:amd64 (2.16.9-0~deb10u1) ...
#6 175.6 Setting up git-man (1:2.20.1-2+deb10u9) ...
#6 175.7 Setting up libssh2-1:amd64 (1.8.0-2.1+deb10u1) ...
#6 175.8 Setting up netbase (5.6) ...
#6 176.1 Setting up libsofia-sip-ua0 (1.12.11+20110422.1-2.1+deb10u4) ...
#6 176.2 Setting up libkrb5-3:amd64 (1.17-3+deb10u6) ...
#6 176.4 Setting up libusb-1.0-0:amd64 (2:1.0.22-2) ...
#6 176.5 Setting up libmpdec2:amd64 (2.4.2-2) ...
#6 176.6 Setting up libbinutils:amd64 (2.31.1-16) ...
#6 176.7 Setting up cpp-8 (8.3.0-6) ...
#6 176.9 Setting up libc-dev-bin (2.28-10+deb10u4) ...
#6 177.0 Setting up libtasn1-6-dev:amd64 (4.13-3+deb10u1) ...
#6 177.2 Setting up openssl (1.1.1n-0+deb10u6) ...
#6 177.4 Setting up libbsd0:amd64 (0.9.1-2+deb10u1) ...
#6 177.5 Setting up libxml2:amd64 (2.9.4+dfsg1-7+deb10u6) ...
#6 177.6 Setting up libcc1-0:amd64 (8.3.0-6) ...
#6 177.8 Setting up sqlite3 (3.27.2-3+deb10u2) ...
#6 177.9 Setting up gpg (2.2.12-1+deb10u2) ...
#6 178.1 Setting up liblsan0:amd64 (8.3.0-6) ...
#6 178.2 Setting up libp11-kit-dev:amd64 (0.23.15-2+deb10u1) ...
#6 178.3 Setting up libitm1:amd64 (8.3.0-6) ...
#6 178.4 Setting up libsofia-sip-ua-glib3 (1.12.11+20110422.1-2.1+deb10u4) ...
#6 178.6 Setting up libgdbm6:amd64 (1.18.1-4) ...
#6 178.7 Setting up gnupg-utils (2.2.12-1+deb10u2) ...
#6 178.9 Setting up binutils-x86-64-linux-gnu (2.31.1-16) ...
#6 179.0 Setting up libtsan0:amd64 (8.3.0-6) ...
#6 179.1 Setting up pinentry-curses (1.1.0-2) ...
#6 179.3 Setting up libdbi-dev (0.9.0-5) ...
#6 179.4 Setting up tcpdump (4.9.3-1~deb10u2) ...
#6 179.6 Setting up libpython3.7-stdlib:amd64 (3.7.3-2+deb10u7) ...
#6 179.8 Setting up flex (2.6.4-6.2) ...
#6 180.0 Setting up libfftw3-single3:amd64 (3.3.8-2) ...
#6 180.5 Setting up libgmp-dev:amd64 (2:6.1.2+dfsg-4+deb10u1) ...
#6 180.6 Setting up gpg-agent (2.2.12-1+deb10u2) ...
#6 180.8 Setting up telnet (0.17-41.2) ...
#6 180.9 update-alternatives: using /usr/bin/telnet.netkit to provide /usr/bin/telnet (telnet) in auto mode
#6 181.1 Setting up wget (1.20.1-1.1) ...
#6 181.8 Setting up nettle-dev:amd64 (3.4.1-1+deb10u1) ...
#6 181.9 Setting up libopts25-dev:amd64 (1:5.18.12-4) ...
#6 182.1 Setting up libmbedx509-0:amd64 (2.16.9-0~deb10u1) ...
#6 182.4 Setting up guile-2.0-libs:amd64 (2.0.13+1-5.1) ...
#6 182.7 Setting up libdbd-sqlite3:amd64 (0.9.0-6+b1) ...
#6 182.9 Setting up gcc-arm-none-eabi (15:7-2018-q2-6) ...
#6 183.0 Setting up libedit2:amd64 (3.1-20181209-1) ...
#6 183.2 Setting up gpgsm (2.2.12-1+deb10u2) ...
#6 183.4 Setting up libmbedtls12:amd64 (2.16.9-0~deb10u1) ...
#6 183.6 Setting up netcat-openbsd (1.195-2) ...
#6 183.7 update-alternatives: using /bin/nc.openbsd to provide /bin/nc (nc) in auto mode
#6 183.7 Setting up libglib2.0-bin (2.58.3-2+deb10u6) ...
#6 183.9 Setting up libldap-2.4-2:amd64 (2.4.47+dfsg-3+deb10u7) ...
#6 184.1 Setting up libfftw3-long3:amd64 (3.3.8-2) ...
#6 184.3 Setting up libusb-1.0-0-dev:amd64 (2:1.0.22-2) ...
#6 184.4 Setting up binutils (2.31.1-16) ...
#6 184.5 Setting up libgps23:amd64 (3.17-7) ...
#6 184.7 Setting up libllvm6.0:amd64 (1:6.0.1-10) ...
#6 184.9 Setting up libclang1-6.0:amd64 (1:6.0.1-10) ...
#6 185.1 Setting up dirmngr (2.2.12-1+deb10u2) ...
#6 185.2 Setting up ca-certificates (20200601~deb10u2) ...
#6 185.4 debconf: unable to initialize frontend: Dialog
#6 185.4 debconf: (TERM is not set, so the dialog frontend is not usable.)
#6 185.4 debconf: falling back to frontend: Readline
#6 185.7 Updating certificates in /etc/ssl/certs...
#6 185.9 137 added, 0 removed; done.
#6 186.2 Setting up doxygen (1.8.13-10) ...
#6 186.3 Setting up libunbound8:amd64 (1.9.0-2+deb10u4) ...
#6 186.5 Setting up libfftw3-quad3:amd64 (3.3.8-2) ...
#6 186.6 Setting up bsdmainutils (11.1.2+b1) ...
#6 187.0 update-alternatives: using /usr/bin/bsd-write to provide /usr/bin/write (write) in auto mode
#6 187.3 update-alternatives: using /usr/bin/bsd-from to provide /usr/bin/from (from) in auto mode
#6 187.5 Setting up libgssapi-krb5-2:amd64 (1.17-3+deb10u6) ...
#6 187.6 Setting up libcroco3:amd64 (0.6.12-3) ...
#6 187.7 Setting up libgdbm-compat4:amd64 (1.18.1-4) ...
#6 188.0 Setting up libgcc-8-dev:amd64 (8.3.0-6) ...
#6 188.5 Setting up libperl5.28:amd64 (5.28.1-6+deb10u1) ...
#6 188.6 Setting up libsofia-sip-ua-dev (1.12.11+20110422.1-2.1+deb10u4) ...
#6 188.8 Setting up gpg-wks-server (2.2.12-1+deb10u2) ...
#6 188.9 Setting up groff-base (1.22.4-3+deb10u1) ...
#6 189.4 Setting up cpp (4:8.3.0-1) ...
#6 189.7 Setting up libc6-dev:amd64 (2.28-10+deb10u4) ...
#6 189.8 Setting up libpython3-stdlib:amd64 (3.7.3-1) ...
#6 190.0 Setting up libstdc++-8-dev:amd64 (8.3.0-6) ...
#6 190.2 Setting up python3.7 (3.7.3-2+deb10u7) ...
#6 190.6 Setting up libgnutls-dane0:amd64 (3.6.7-4+deb10u12) ...
#6 190.8 Setting up libncurses-dev:amd64 (6.1+20181013-2+deb10u5) ...
#6 191.2 Setting up gettext (0.19.8.1-9) ...
#6 191.4 Setting up gcc-8 (8.3.0-6) ...
#6 191.5 Setting up gpg-wks-client (2.2.12-1+deb10u2) ...
#6 191.7 Setting up libtool (2.4.6-9) ...
#6 191.8 Setting up libfftw3-bin (3.3.8-2) ...
#6 192.0 Setting up libpcre3-dev:amd64 (2:8.39-12) ...
#6 200.5 Setting up libbctoolbox1:amd64 (0.6.0-2+b2) ...
#6 201.1 Setting up libpcap0.8-dev:amd64 (1.8.1-6+deb10u1) ...
#6 201.3 Setting up libcurl3-gnutls:amd64 (7.64.0-4+deb10u9) ...
#6 201.6 Setting up python3 (3.7.3-1) ...
#6 201.8 running python rtupdate hooks for python3.7...
#6 201.9 running python post-rtupdate hooks for python3.7...
#6 201.9 Setting up libusb-dev (2:0.1.12-32) ...
#6 202.2 Setting up libreadline-dev:amd64 (7.0-5) ...
#6 202.3 Setting up man-db (2.8.5-2+deb10u1) ...
#6 202.7 debconf: unable to initialize frontend: Dialog
#6 202.7 debconf: (TERM is not set, so the dialog frontend is not usable.)
#6 202.7 debconf: falling back to frontend: Readline
#6 202.7 Building database of manual pages ...
#6 212.5 Setting up gcc (4:8.3.0-1) ...
#6 212.8 Setting up python3-six (1.12.0-1) ...
#6 213.2 Setting up perl (5.28.1-6+deb10u1) ...
#6 213.6 Setting up python3-pygments (2.3.1+dfsg-1+deb10u2) ...
#6 213.9 Setting up libsqlite3-dev:amd64 (3.27.2-3+deb10u2) ...
#6 214.1 Setting up uuid-dev:amd64 (2.33.1-0.1+deb10u1) ...
#6 214.2 Setting up stow (2.2.2-1) ...
#6 214.3 Setting up libio-html-perl (1.001-1) ...
#6 214.4 Setting up libb-hooks-op-check-perl (0.22-1+b1) ...
#6 214.6 Setting up libsctp-dev:amd64 (1.0.18+dfsg-1) ...
#6 214.7 Setting up libbctoolbox-dev (0.6.0-2+b2) ...
#6 214.8 Setting up libdpkg-perl (1.19.8) ...
#6 215.0 Setting up autoconf (2.69-11) ...
#6 215.2 Setting up cppcheck (1.86-1) ...
#6 215.3 Setting up libsub-exporter-progressive-perl (0.001013-1) ...
#6 215.4 Setting up libtimedate-perl (2.3000-2+deb10u1) ...
#6 215.5 Setting up module-assistant (0.11.10) ...
#6 215.7 Setting up zlib1g-dev:amd64 (1:1.2.11.dfsg-1+deb10u2) ...
#6 215.9 Setting up g++-8 (8.3.0-6) ...
#6 216.2 Setting up libncurses5-dev:amd64 (6.1+20181013-2+deb10u5) ...
#6 216.3 Setting up gnupg (2.2.12-1+deb10u2) ...
#6 216.5 Setting up python3-dateutil (2.7.3-3) ...
#6 216.7 Setting up libdevel-globaldestruction-perl (0.14-1) ...
#6 217.0 Setting up libstrictures-perl (2.000005-1) ...
#6 217.1 Setting up libsub-quote-perl (2.005001-1) ...
#6 217.2 Setting up python3-lib2to3 (3.7.3-1) ...
#6 217.4 Setting up libfftw3-dev:amd64 (3.3.8-2) ...
#6 217.6 Setting up liburi-perl (1.76-1) ...
#6 217.8 Setting up libortp13:amd64 (1:1.0.2-1) ...
#6 218.0 Setting up libnet-ssleay-perl (1.85-2+deb10u1) ...
#6 218.2 Setting up python3-pkg-resources (40.8.0-1) ...
#6 218.7 Setting up automake (1:1.16.1-4) ...
#6 218.8 update-alternatives: using /usr/bin/automake-1.16 to provide /usr/bin/automake (automake) in auto mode
#6 218.8 Setting up python3-distutils (3.7.3-1) ...
#6 219.0 Setting up libgnutls28-dev:amd64 (3.6.7-4+deb10u12) ...
#6 219.2 Setting up libglib2.0-dev-bin (2.58.3-2+deb10u6) ...
#6 219.4 Setting up libblkid-dev:amd64 (2.33.1-0.1+deb10u1) ...
#6 219.5 Setting up libhttp-date-perl (6.02-1) ...
#6 219.7 Setting up libfile-which-perl (1.23-1) ...
#6 219.8 Setting up libpcap-dev:amd64 (1.8.1-6+deb10u1) ...
#6 220.0 Setting up libfile-listing-perl (6.04-1) ...
#6 220.1 Setting up libdynaloader-functions-perl (0.003-1) ...
#6 220.2 Setting up libclass-method-modifiers-perl (2.12-1) ...
#6 220.4 Setting up libio-pty-perl (1:1.08-1.1+b5) ...
#6 220.5 Setting up libselinux1-dev:amd64 (2.8-1+b1) ...
#6 220.7 Setting up libarchive-zip-perl (1.64-1) ...
#6 220.8 Setting up libhtml-tagset-perl (3.20-3) ...
#6 220.9 Setting up liblwp-mediatypes-perl (6.02-1) ...
#6 221.1 Setting up libtry-tiny-perl (0.30-1) ...
#6 221.2 Setting up libnet-http-perl (6.18-1) ...
#6 221.4 Setting up libencode-locale-perl (1.05-1) ...
#6 221.6 Setting up libdevel-callchecker-perl (0.008-1) ...
#6 221.7 Setting up autogen (1:5.18.12-4) ...
#6 221.9 Setting up dpkg-dev (1.19.8) ...
#6 222.2 Setting up intltool-debian (0.35.0+20060710.5) ...
#6 222.7 Setting up liberror-perl (0.17027-2) ...
#6 222.8 Setting up patchutils (0.3.4-2) ...
#6 222.9 Setting up pkg-config (0.29-6) ...
#6 223.1 Setting up libipc-run-perl (20180523.0-1) ...
#6 223.9 Setting up git (1:2.20.1-2+deb10u9) ...
#6 224.1 Setting up libwww-robotrules-perl (6.02-1) ...
#6 224.3 Setting up g++ (4:8.3.0-1) ...
#6 224.4 update-alternatives: using /usr/bin/g++ to provide /usr/bin/c++ (c++) in auto mode
#6 224.4 Setting up libhtml-parser-perl (3.72-3+b3) ...
#6 224.7 Setting up librole-tiny-perl (2.000006-1) ...
#6 224.8 Setting up build-essential (12.6) ...
#6 225.0 Setting up libfile-homedir-perl (1.004-1) ...
#6 225.1 Setting up libgps-dev (3.17-7) ...
#6 225.2 Setting up libmount-dev:amd64 (2.33.1-0.1+deb10u1) ...
#6 225.3 Setting up libio-socket-ssl-perl (2.060-3) ...
#6 225.5 Setting up libortp-dev:amd64 (1:1.0.2-1) ...
#6 225.6 Setting up libhttp-message-perl (6.18-1) ...
#6 225.8 Setting up libfile-stripnondeterminism-perl (1.1.2-1) ...
#6 225.9 Setting up libhttp-negotiate-perl (6.01-1) ...
#6 226.0 Setting up libhttp-cookies-perl (6.04-1) ...
#6 226.2 Setting up po-debconf (1.0.21) ...
#6 226.3 Setting up libhtml-tree-perl (5.07-2) ...
#6 226.4 Setting up libparams-classify-perl (0.015-1+b1) ...
#6 226.6 Setting up libtalloc-dev:amd64 (2.1.14-2) ...
#6 227.1 Setting up libglib2.0-dev:amd64 (2.58.3-2+deb10u6) ...
#6 227.2 Setting up libmodule-runtime-perl (0.016-1) ...
#6 227.4 Setting up libsofia-sip-ua-glib-dev (1.12.11+20110422.1-2.1+deb10u4) ...
#6 227.5 Setting up libimport-into-perl (1.002005-1) ...
#6 227.7 Setting up libmoo-perl (2.003004-2) ...
#6 227.8 Setting up dh-autoreconf (19) ...
#6 227.9 Setting up liblwp-protocol-https-perl (6.07-2) ...
#6 228.0 Setting up libwww-perl (6.36-2) ...
#6 228.2 Setting up debhelper (12.1.1) ...
#6 228.3 Setting up devscripts (2.19.5+deb10u1) ...
#6 228.5 Setting up git-buildpackage (0.9.14) ...
#6 228.7 Setting up dh-strip-nondeterminism (1.1.2-1) ...
#6 228.9 Setting up equivs (2.2.0) ...
#6 229.0 Setting up dh-systemd (12.1.1) ...
#6 232.0 Setting up dahdi-source (1:2.11.1.0.20170917~dfsg-7) ...
#6 232.2 Processing triggers for libc-bin (2.28-10+deb10u4) ...
#6 232.3 Processing triggers for ca-certificates (20200601~deb10u2) ...
#6 232.4 Updating certificates in /etc/ssl/certs...
#6 232.7 0 added, 0 removed; done.
#6 232.7 Running hooks in /etc/ca-certificates/update.d...
#6 232.7 done.
#6 DONE 241.5s

#9 [3/6] COPY	.COMMON/RESPAWN.SH /usr/local/bin/respawn.sh
#9 DONE 0.5s

#10 [4/6] COPY	.COMMON/RELEASE.KEY /tmp/Release.key
#10 DONE 0.5s

#11 [5/6] RUN	APT-KEY add /tmp/Release.key && 	rm /tmp/Release.key && 	echo "deb " https://downloads.osmocom.org/packages/osmocom:/nightly/Debian_10/ " ./" > /etc/apt/sources.list.d/osmocom-nightly.list
#11 0.746 Warning: apt-key output should not be parsed (stdout is not a terminal)
#11 1.250 OK
#11 DONE 1.7s

#12 [6/6] ADD	HTTPS://DOWNLOADS.OSMOCOM.ORG/PACKAGES/OSMOCOM:/NIGHTLY/DEBIAN_10//RELEASE /tmp/Release
#12 DONE 0.5s

#13 exporting to image
#13 exporting layers
#13 exporting layers 4.9s done
#13 writing image sha256:7e9a6a92d3ece62012a85c1133155e5bc8a4e0cc0eccb8b8d5d49e93f6372b4c 0.0s done
#13 naming to docker.io/osmocom-build/debian-buster-build:latest 0.1s done
#13 DONE 5.1s
rm -rf .common
make: Leaving directory '/home/osmocom-build/jenkins/workspace/nplab-m3ua-test/debian-buster-build'
+ docker_image_exists debian-buster-build
+ docker images -q osmocom-build/debian-buster-build
+ test -n 7e9a6a92d3ec
+ list_osmo_packages debian-buster debian-buster-build
+ local distro=debian-buster
+ local image=debian-buster-build
+ local docker_run_sh=docker run --rm --entrypoint=/bin/sh osmocom-build/debian-buster-build -c
+ [ -n  ]
+ return
+ [ registry.osmocom.org = registry.osmocom.org ]
+ docker_depends sigtran-tests
+ local feed
+ depends=
+ [ -n  ]
+ docker_distro_from_image_name sigtran-tests
+ echo debian-bookworm
+ distro_arg=debian-bookworm
+ [ -z  ]
+ docker_upstream_distro_from_image_name sigtran-tests
+ echo debian:bookworm
+ upstream_distro_arg=debian:bookworm
+ docker_dir_from_image_name sigtran-tests
+ echo sigtran-tests
+ dir=sigtran-tests
+ [ -z  ]
+ pull_arg=--pull
+ grep ^FROM ../sigtran-tests/Dockerfile
+ from_line=FROM	$USER/debian-buster-build
+ echo FROM	$USER/debian-buster-build
+ grep -q $USER
+ pull_arg=
+ set +x
Building image: sigtran-tests (export NO_DOCKER_IMAGE_BUILD=1 to prevent this)
+ docker_osmo_ttcn3_branch
+ [ -n  ]
+ echo master
+ make -C ../sigtran-tests BUILD_ARGS= UPSTREAM_DISTRO=debian:bookworm DISTRO=debian-bookworm IMAGE=osmocom-build/sigtran-tests OSMO_TTCN3_BRANCH=master
make: Entering directory '/home/osmocom-build/jenkins/workspace/nplab-m3ua-test/sigtran-tests'
awk: fatal: cannot open file `.release' for reading: No such file or directory
awk: fatal: cannot open file `.release' for reading: No such file or directory
awk: fatal: cannot open file `.release' for reading: No such file or directory
rm -rf .common
cp -r /home/osmocom-build/jenkins/workspace/nplab-m3ua-test/common .common
INFO: .release created
release=0.0.0
docker build \
	--build-arg USER=osmocom-build \
	--build-arg UID=1000 \
	--build-arg REGISTRY=registry.osmocom.org \
	--build-arg OSMO_TTCN3_BRANCH=master \
	--build-arg UPSTREAM_DISTRO=debian:bookworm \
	--build-arg DISTRO=debian-bookworm \
	--build-arg OSMOCOM_REPO_MIRROR=https://downloads.osmocom.org \
	--build-arg OSMOCOM_REPO_PATH=packages/osmocom: \
	--build-arg OSMOCOM_REPO_VERSION=latest \
	--build-arg OSMOCOM_REPO_TESTSUITE_MIRROR=https://downloads.osmocom.org \
	--build-arg ASTERISK_BRANCH=sysmocom/20.7.0 \
	--build-arg LIBOSMOCORE_BRANCH=master \
	--build-arg OSMO_BB_BRANCH=master \
	--build-arg OSMO_BSC_BRANCH=master \
	--build-arg OSMO_BTS_BRANCH=master \
	--build-arg OSMO_CBC_BRANCH=master \
	--build-arg OSMO_DIA2GSUP_BRANCH=master \
	--build-arg OSMO_EPDG_BRANCH=master \
	--build-arg OSMO_GBPROXY_BRANCH=master \
	--build-arg OSMO_GGSN_BRANCH=master \
	--build-arg OSMO_GSM_TESTER_BRANCH=master \
	--build-arg OSMO_HLR_BRANCH=master \
	--build-arg OSMO_HNBGW_BRANCH=master \
	--build-arg OSMO_HNODEB_BRANCH=master \
	--build-arg OSMO_IUH_BRANCH=master \
	--build-arg OSMO_MGW_BRANCH=master \
	--build-arg OSMO_MSC_BRANCH=master \
	--build-arg OSMO_NITB_BRANCH=master \
	--build-arg OSMO_PCU_BRANCH=master \
	--build-arg OSMO_REMSIM_BRANCH=master \
	--build-arg OSMO_SGSN_BRANCH=master \
	--build-arg OSMO_SIP_BRANCH=master \
	--build-arg OSMO_STP_BRANCH=master \
	--build-arg OSMO_UECUPS_BRANCH=master \
	--build-arg OPEN5GS_BRANCH=main \
	--build-arg PJPROJECT_BRANCH=sysmocom/2.14 \
	 -t osmocom-build/sigtran-tests:latest .
#0 building with "default" instance using docker driver

#1 [internal] load build definition from Dockerfile
#1 transferring dockerfile:
#1 transferring dockerfile: 545B done
#1 DONE 0.7s

#2 [internal] load metadata for docker.io/osmocom-build/debian-buster-build:latest
#2 DONE 0.0s

#3 [internal] load .dockerignore
#3 transferring context:
#3 transferring context: 2B done
#3 DONE 0.4s

#4 [1/4] FROM docker.io/osmocom-build/debian-buster-build:latest
#4 DONE 1.7s

#5 [2/4] RUN	APT-GET update && apt-get -y install				guile-2.0 guile-2.0-dev gnulib tcsh 		python3 python3-pip
#5 0.965 Hit:1 http://deb.debian.org/debian buster InRelease
#5 0.965 Hit:2 http://deb.debian.org/debian-security buster/updates InRelease
#5 0.965 Hit:3 http://deb.debian.org/debian buster-updates InRelease
#5 0.965 Get:4 https://downloads.osmocom.org/packages/osmocom:/nightly/Debian_10 ./ InRelease [1570 B]
#5 1.465 Get:5 https://downloads.osmocom.org/packages/osmocom:/nightly/Debian_10 ./ Packages [122 kB]
#5 1.484 Fetched 123 kB in 1s (182 kB/s)
#5 1.484 Reading package lists...
#5 1.817 Reading package lists...
#5 2.152 Building dependency tree...
#5 2.215 Reading state information...
#5 2.268 python3 is already the newest version (3.7.3-1).
#5 2.268 python3 set to manually installed.
#5 2.268 The following additional packages will be installed:
#5 2.268   dbus dh-python gir1.2-glib-2.0 gperf libapparmor1 libexpat1-dev libgc-dev
#5 2.268   libgirepository-1.0-1 libltdl-dev libpython3-dev libpython3.7
#5 2.268   libpython3.7-dev libtext-unidecode-perl libxml-libxml-perl
#5 2.268   libxml-namespacesupport-perl libxml-parser-perl libxml-sax-base-perl
#5 2.268   libxml-sax-expat-perl libxml-sax-perl python-pip-whl python3-asn1crypto
#5 2.268   python3-cffi-backend python3-crypto python3-cryptography python3-dbus
#5 2.268   python3-dev python3-entrypoints python3-gi python3-keyring
#5 2.268   python3-keyrings.alt python3-secretstorage python3-setuptools python3-wheel
#5 2.268   python3-xdg python3.7-dev tex-common texinfo ucf
#5 2.268 Suggested packages:
#5 2.268   default-dbus-session-bus | dbus-session-bus clisp guile-2.0-doc libtool-doc
#5 2.268   libxml-sax-expatxs-perl python-crypto-doc python-cryptography-doc
#5 2.268   python3-cryptography-vectors python-dbus-doc python3-dbus-dbg gnome-keyring
#5 2.268   libkf5wallet-bin gir1.2-gnomekeyring-1.0 python-secretstorage-doc
#5 2.268   python-setuptools-doc texlive-base texlive-latex-base
#5 2.268   texlive-generic-recommended texinfo-doc-nonfree texlive-fonts-recommended
#5 2.412 The following NEW packages will be installed:
#5 2.412   dbus dh-python gir1.2-glib-2.0 gnulib gperf guile-2.0 guile-2.0-dev
#5 2.412   libapparmor1 libexpat1-dev libgc-dev libgirepository-1.0-1 libltdl-dev
#5 2.412   libpython3-dev libpython3.7 libpython3.7-dev libtext-unidecode-perl
#5 2.412   libxml-libxml-perl libxml-namespacesupport-perl libxml-parser-perl
#5 2.412   libxml-sax-base-perl libxml-sax-expat-perl libxml-sax-perl python-pip-whl
#5 2.412   python3-asn1crypto python3-cffi-backend python3-crypto python3-cryptography
#5 2.412   python3-dbus python3-dev python3-entrypoints python3-gi python3-keyring
#5 2.412   python3-keyrings.alt python3-pip python3-secretstorage python3-setuptools
#5 2.412   python3-wheel python3-xdg python3.7-dev tcsh tex-common texinfo ucf
#5 2.430 0 upgraded, 43 newly installed, 0 to remove and 0 not upgraded.
#5 2.430 Need to get 63.0 MB of archives.
#5 2.430 After this operation, 161 MB of additional disk space will be used.
#5 2.430 Get:1 http://deb.debian.org/debian buster/main amd64 ucf all 3.0038+nmu1 [69.0 kB]
#5 2.449 Get:2 http://deb.debian.org/debian buster/main amd64 tex-common all 6.11 [53.1 kB]
#5 2.450 Get:3 http://deb.debian.org/debian buster/main amd64 libapparmor1 amd64 2.13.2-10 [94.7 kB]
#5 2.455 Get:4 http://deb.debian.org/debian-security buster/updates/main amd64 dbus amd64 1.12.28-0+deb10u1 [240 kB]
#5 2.460 Get:5 http://deb.debian.org/debian buster/main amd64 dh-python all 3.20190308 [99.3 kB]
#5 2.461 Get:6 http://deb.debian.org/debian buster/main amd64 libgirepository-1.0-1 amd64 1.58.3-2 [92.8 kB]
#5 2.462 Get:7 http://deb.debian.org/debian buster/main amd64 gir1.2-glib-2.0 amd64 1.58.3-2 [143 kB]
#5 2.463 Get:8 http://deb.debian.org/debian buster/main amd64 gperf amd64 3.1-1 [147 kB]
#5 2.466 Get:9 http://deb.debian.org/debian buster/main amd64 libtext-unidecode-perl all 1.30-1 [103 kB]
#5 2.466 Get:10 http://deb.debian.org/debian buster/main amd64 libxml-namespacesupport-perl all 1.12-1 [14.8 kB]
#5 2.467 Get:11 http://deb.debian.org/debian buster/main amd64 libxml-sax-base-perl all 1.09-1 [20.4 kB]
#5 2.467 Get:12 http://deb.debian.org/debian buster/main amd64 libxml-sax-perl all 1.00+dfsg-1 [58.6 kB]
#5 2.467 Get:13 http://deb.debian.org/debian buster/main amd64 libxml-libxml-perl amd64 2.0134+dfsg-1 [344 kB]
#5 2.470 Get:14 http://deb.debian.org/debian buster/main amd64 texinfo amd64 6.5.0.dfsg.1-4+b1 [1431 kB]
#5 2.505 Get:15 http://deb.debian.org/debian buster/main amd64 gnulib all 20140202+stable-4 [4408 kB]
#5 2.597 Get:16 http://deb.debian.org/debian buster/main amd64 guile-2.0 amd64 2.0.13+1-5.1 [18.1 kB]
#5 2.597 Get:17 http://deb.debian.org/debian buster/main amd64 libltdl-dev amd64 2.4.6-9 [162 kB]
#5 2.661 Get:18 http://deb.debian.org/debian buster/main amd64 libgc-dev amd64 1:7.6.4-0.4 [373 kB]
#5 2.667 Get:19 http://deb.debian.org/debian buster/main amd64 guile-2.0-dev amd64 2.0.13+1-5.1 [699 kB]
#5 2.670 Get:20 http://deb.debian.org/debian-security buster/updates/main amd64 libexpat1-dev amd64 2.2.6-2+deb10u7 [156 kB]
#5 2.671 Get:21 http://deb.debian.org/debian-security buster/updates/main amd64 libpython3.7 amd64 3.7.3-2+deb10u7 [1499 kB]
#5 2.677 Get:22 http://deb.debian.org/debian-security buster/updates/main amd64 libpython3.7-dev amd64 3.7.3-2+deb10u7 [48.4 MB]
#5 3.141 Get:23 http://deb.debian.org/debian buster/main amd64 libpython3-dev amd64 3.7.3-1 [20.1 kB]
#5 3.141 Get:24 http://deb.debian.org/debian buster/main amd64 libxml-parser-perl amd64 2.44-4 [213 kB]
#5 3.143 Get:25 http://deb.debian.org/debian buster/main amd64 libxml-sax-expat-perl all 0.51-1 [12.0 kB]
#5 3.143 Get:26 http://deb.debian.org/debian buster/main amd64 python-pip-whl all 18.1-5 [1591 kB]
#5 3.150 Get:27 http://deb.debian.org/debian buster/main amd64 python3-asn1crypto all 0.24.0-1 [78.2 kB]
#5 3.151 Get:28 http://deb.debian.org/debian buster/main amd64 python3-cffi-backend amd64 1.12.2-1 [79.7 kB]
#5 3.151 Get:29 http://deb.debian.org/debian buster/main amd64 python3-crypto amd64 2.6.1-9+b1 [263 kB]
#5 3.153 Get:30 http://deb.debian.org/debian-security buster/updates/main amd64 python3-cryptography amd64 2.6.1-3+deb10u4 [218 kB]
#5 3.154 Get:31 http://deb.debian.org/debian buster/main amd64 python3-dbus amd64 1.2.8-3 [103 kB]
#5 3.155 Get:32 http://deb.debian.org/debian-security buster/updates/main amd64 python3.7-dev amd64 3.7.3-2+deb10u7 [514 kB]
#5 3.157 Get:33 http://deb.debian.org/debian buster/main amd64 python3-dev amd64 3.7.3-1 [1264 B]
#5 3.157 Get:34 http://deb.debian.org/debian buster/main amd64 python3-entrypoints all 0.3-1 [5508 B]
#5 3.157 Get:35 http://deb.debian.org/debian buster/main amd64 python3-gi amd64 3.30.4-1 [180 kB]
#5 3.158 Get:36 http://deb.debian.org/debian buster/main amd64 python3-secretstorage all 2.3.1-2 [14.2 kB]
#5 3.158 Get:37 http://deb.debian.org/debian buster/main amd64 python3-keyring all 17.1.1-1 [43.1 kB]
#5 3.160 Get:38 http://deb.debian.org/debian buster/main amd64 python3-keyrings.alt all 3.1.1-1 [18.2 kB]
#5 3.162 Get:39 http://deb.debian.org/debian buster/main amd64 python3-pip all 18.1-5 [171 kB]
#5 3.164 Get:40 http://deb.debian.org/debian buster/main amd64 python3-setuptools all 40.8.0-1 [306 kB]
#5 3.167 Get:41 http://deb.debian.org/debian buster/main amd64 python3-wheel all 0.32.3-2 [19.4 kB]
#5 3.167 Get:42 http://deb.debian.org/debian buster/main amd64 python3-xdg all 0.25-5 [35.9 kB]
#5 3.168 Get:43 http://deb.debian.org/debian buster/main amd64 tcsh amd64 6.20.00-7+b1 [473 kB]
#5 3.650 debconf: delaying package configuration, since apt-utils is not installed
#5 3.703 Fetched 63.0 MB in 1s (83.5 MB/s)
#5 3.888 Selecting previously unselected package ucf.
#5 3.888 (Reading database ... 
(Reading database ... 5%
(Reading database ... 10%
(Reading database ... 15%
(Reading database ... 20%
(Reading database ... 25%
(Reading database ... 30%
(Reading database ... 35%
(Reading database ... 40%
(Reading database ... 45%
(Reading database ... 50%
(Reading database ... 55%
(Reading database ... 60%
(Reading database ... 65%
(Reading database ... 70%
(Reading database ... 75%
(Reading database ... 80%
(Reading database ... 85%
(Reading database ... 90%
(Reading database ... 95%
(Reading database ... 100%
(Reading database ... 25305 files and directories currently installed.)
#5 3.896 Preparing to unpack .../00-ucf_3.0038+nmu1_all.deb ...
#5 4.029 Moving old data out of the way
#5 4.032 Unpacking ucf (3.0038+nmu1) ...
#5 5.305 Selecting previously unselected package tex-common.
#5 5.307 Preparing to unpack .../01-tex-common_6.11_all.deb ...
#5 5.379 Unpacking tex-common (6.11) ...
#5 6.129 Selecting previously unselected package libapparmor1:amd64.
#5 6.132 Preparing to unpack .../02-libapparmor1_2.13.2-10_amd64.deb ...
#5 6.218 Unpacking libapparmor1:amd64 (2.13.2-10) ...
#5 6.576 Selecting previously unselected package dbus.
#5 6.578 Preparing to unpack .../03-dbus_1.12.28-0+deb10u1_amd64.deb ...
#5 6.626 Unpacking dbus (1.12.28-0+deb10u1) ...
#5 6.990 Selecting previously unselected package dh-python.
#5 6.992 Preparing to unpack .../04-dh-python_3.20190308_all.deb ...
#5 7.037 Unpacking dh-python (3.20190308) ...
#5 7.321 Selecting previously unselected package libgirepository-1.0-1:amd64.
#5 7.322 Preparing to unpack .../05-libgirepository-1.0-1_1.58.3-2_amd64.deb ...
#5 7.419 Unpacking libgirepository-1.0-1:amd64 (1.58.3-2) ...
#5 7.840 Selecting previously unselected package gir1.2-glib-2.0:amd64.
#5 7.841 Preparing to unpack .../06-gir1.2-glib-2.0_1.58.3-2_amd64.deb ...
#5 7.885 Unpacking gir1.2-glib-2.0:amd64 (1.58.3-2) ...
#5 8.099 Selecting previously unselected package gperf.
#5 8.101 Preparing to unpack .../07-gperf_3.1-1_amd64.deb ...
#5 8.139 Unpacking gperf (3.1-1) ...
#5 8.379 Selecting previously unselected package libtext-unidecode-perl.
#5 8.382 Preparing to unpack .../08-libtext-unidecode-perl_1.30-1_all.deb ...
#5 8.427 Unpacking libtext-unidecode-perl (1.30-1) ...
#5 8.697 Selecting previously unselected package libxml-namespacesupport-perl.
#5 8.702 Preparing to unpack .../09-libxml-namespacesupport-perl_1.12-1_all.deb ...
#5 8.733 Unpacking libxml-namespacesupport-perl (1.12-1) ...
#5 8.996 Selecting previously unselected package libxml-sax-base-perl.
#5 8.999 Preparing to unpack .../10-libxml-sax-base-perl_1.09-1_all.deb ...
#5 9.040 Unpacking libxml-sax-base-perl (1.09-1) ...
#5 9.345 Selecting previously unselected package libxml-sax-perl.
#5 9.348 Preparing to unpack .../11-libxml-sax-perl_1.00+dfsg-1_all.deb ...
#5 9.389 Unpacking libxml-sax-perl (1.00+dfsg-1) ...
#5 9.660 Selecting previously unselected package libxml-libxml-perl.
#5 9.663 Preparing to unpack .../12-libxml-libxml-perl_2.0134+dfsg-1_amd64.deb ...
#5 9.703 Unpacking libxml-libxml-perl (2.0134+dfsg-1) ...
#5 10.12 Selecting previously unselected package texinfo.
#5 10.12 Preparing to unpack .../13-texinfo_6.5.0.dfsg.1-4+b1_amd64.deb ...
#5 10.16 Unpacking texinfo (6.5.0.dfsg.1-4+b1) ...
#5 10.49 Selecting previously unselected package gnulib.
#5 10.49 Preparing to unpack .../14-gnulib_20140202+stable-4_all.deb ...
#5 10.53 Unpacking gnulib (20140202+stable-4) ...
#5 11.38 Selecting previously unselected package guile-2.0.
#5 11.39 Preparing to unpack .../15-guile-2.0_2.0.13+1-5.1_amd64.deb ...
#5 11.43 Unpacking guile-2.0 (2.0.13+1-5.1) ...
#5 11.65 Selecting previously unselected package libltdl-dev:amd64.
#5 11.65 Preparing to unpack .../16-libltdl-dev_2.4.6-9_amd64.deb ...
#5 11.69 Unpacking libltdl-dev:amd64 (2.4.6-9) ...
#5 11.94 Selecting previously unselected package libgc-dev:amd64.
#5 11.94 Preparing to unpack .../17-libgc-dev_1%3a7.6.4-0.4_amd64.deb ...
#5 11.98 Unpacking libgc-dev:amd64 (1:7.6.4-0.4) ...
#5 12.33 Selecting previously unselected package guile-2.0-dev.
#5 12.33 Preparing to unpack .../18-guile-2.0-dev_2.0.13+1-5.1_amd64.deb ...
#5 12.37 Unpacking guile-2.0-dev (2.0.13+1-5.1) ...
#5 12.61 Selecting previously unselected package libexpat1-dev:amd64.
#5 12.62 Preparing to unpack .../19-libexpat1-dev_2.2.6-2+deb10u7_amd64.deb ...
#5 12.68 Unpacking libexpat1-dev:amd64 (2.2.6-2+deb10u7) ...
#5 13.15 Selecting previously unselected package libpython3.7:amd64.
#5 13.15 Preparing to unpack .../20-libpython3.7_3.7.3-2+deb10u7_amd64.deb ...
#5 13.19 Unpacking libpython3.7:amd64 (3.7.3-2+deb10u7) ...
#5 13.48 Selecting previously unselected package libpython3.7-dev:amd64.
#5 13.48 Preparing to unpack .../21-libpython3.7-dev_3.7.3-2+deb10u7_amd64.deb ...
#5 13.51 Unpacking libpython3.7-dev:amd64 (3.7.3-2+deb10u7) ...
#5 16.03 Selecting previously unselected package libpython3-dev:amd64.
#5 16.03 Preparing to unpack .../22-libpython3-dev_3.7.3-1_amd64.deb ...
#5 16.08 Unpacking libpython3-dev:amd64 (3.7.3-1) ...
#5 16.31 Selecting previously unselected package libxml-parser-perl.
#5 16.31 Preparing to unpack .../23-libxml-parser-perl_2.44-4_amd64.deb ...
#5 16.35 Unpacking libxml-parser-perl (2.44-4) ...
#5 16.67 Selecting previously unselected package libxml-sax-expat-perl.
#5 16.67 Preparing to unpack .../24-libxml-sax-expat-perl_0.51-1_all.deb ...
#5 16.71 Unpacking libxml-sax-expat-perl (0.51-1) ...
#5 16.95 Selecting previously unselected package python-pip-whl.
#5 16.96 Preparing to unpack .../25-python-pip-whl_18.1-5_all.deb ...
#5 17.00 Unpacking python-pip-whl (18.1-5) ...
#5 17.37 Selecting previously unselected package python3-asn1crypto.
#5 17.37 Preparing to unpack .../26-python3-asn1crypto_0.24.0-1_all.deb ...
#5 17.41 Unpacking python3-asn1crypto (0.24.0-1) ...
#5 17.69 Selecting previously unselected package python3-cffi-backend.
#5 17.69 Preparing to unpack .../27-python3-cffi-backend_1.12.2-1_amd64.deb ...
#5 17.73 Unpacking python3-cffi-backend (1.12.2-1) ...
#5 17.99 Selecting previously unselected package python3-crypto.
#5 18.00 Preparing to unpack .../28-python3-crypto_2.6.1-9+b1_amd64.deb ...
#5 18.03 Unpacking python3-crypto (2.6.1-9+b1) ...
#5 18.30 Selecting previously unselected package python3-cryptography.
#5 18.31 Preparing to unpack .../29-python3-cryptography_2.6.1-3+deb10u4_amd64.deb ...
#5 18.35 Unpacking python3-cryptography (2.6.1-3+deb10u4) ...
#5 18.64 Selecting previously unselected package python3-dbus.
#5 18.65 Preparing to unpack .../30-python3-dbus_1.2.8-3_amd64.deb ...
#5 18.70 Unpacking python3-dbus (1.2.8-3) ...
#5 18.97 Selecting previously unselected package python3.7-dev.
#5 18.97 Preparing to unpack .../31-python3.7-dev_3.7.3-2+deb10u7_amd64.deb ...
#5 19.01 Unpacking python3.7-dev (3.7.3-2+deb10u7) ...
#5 19.23 Selecting previously unselected package python3-dev.
#5 19.23 Preparing to unpack .../32-python3-dev_3.7.3-1_amd64.deb ...
#5 19.27 Unpacking python3-dev (3.7.3-1) ...
#5 19.58 Selecting previously unselected package python3-entrypoints.
#5 19.58 Preparing to unpack .../33-python3-entrypoints_0.3-1_all.deb ...
#5 19.62 Unpacking python3-entrypoints (0.3-1) ...
#5 19.91 Selecting previously unselected package python3-gi.
#5 19.91 Preparing to unpack .../34-python3-gi_3.30.4-1_amd64.deb ...
#5 19.96 Unpacking python3-gi (3.30.4-1) ...
#5 20.34 Selecting previously unselected package python3-secretstorage.
#5 20.34 Preparing to unpack .../35-python3-secretstorage_2.3.1-2_all.deb ...
#5 20.38 Unpacking python3-secretstorage (2.3.1-2) ...
#5 20.65 Selecting previously unselected package python3-keyring.
#5 20.66 Preparing to unpack .../36-python3-keyring_17.1.1-1_all.deb ...
#5 20.70 Unpacking python3-keyring (17.1.1-1) ...
#5 27.93 Selecting previously unselected package python3-keyrings.alt.
#5 27.93 Preparing to unpack .../37-python3-keyrings.alt_3.1.1-1_all.deb ...
#5 27.97 Unpacking python3-keyrings.alt (3.1.1-1) ...
#5 28.24 Selecting previously unselected package python3-pip.
#5 28.24 Preparing to unpack .../38-python3-pip_18.1-5_all.deb ...
#5 28.28 Unpacking python3-pip (18.1-5) ...
#5 28.55 Selecting previously unselected package python3-setuptools.
#5 28.56 Preparing to unpack .../39-python3-setuptools_40.8.0-1_all.deb ...
#5 28.60 Unpacking python3-setuptools (40.8.0-1) ...
#5 28.98 Selecting previously unselected package python3-wheel.
#5 28.99 Preparing to unpack .../40-python3-wheel_0.32.3-2_all.deb ...
#5 29.03 Unpacking python3-wheel (0.32.3-2) ...
#5 29.32 Selecting previously unselected package python3-xdg.
#5 29.32 Preparing to unpack .../41-python3-xdg_0.25-5_all.deb ...
#5 29.37 Unpacking python3-xdg (0.25-5) ...
#5 30.00 Selecting previously unselected package tcsh.
#5 30.00 Preparing to unpack .../42-tcsh_6.20.00-7+b1_amd64.deb ...
#5 30.09 Unpacking tcsh (6.20.00-7+b1) ...
#5 30.50 Setting up python3-entrypoints (0.3-1) ...
#5 30.69 Setting up dh-python (3.20190308) ...
#5 31.03 Setting up libxml-parser-perl (2.44-4) ...
#5 31.17 Setting up python3-dbus (1.2.8-3) ...
#5 31.39 Setting up libapparmor1:amd64 (2.13.2-10) ...
#5 31.58 Setting up python3-setuptools (40.8.0-1) ...
#5 31.91 Setting up libpython3.7:amd64 (3.7.3-2+deb10u7) ...
#5 32.07 Setting up guile-2.0 (2.0.13+1-5.1) ...
#5 32.20 update-alternatives: using /usr/lib/x86_64-linux-gnu/guile-2.0/bin/guile to provide /usr/bin/guile (guile) in auto mode
#5 32.33 Setting up libxml-namespacesupport-perl (1.12-1) ...
#5 32.48 Setting up python3-xdg (0.25-5) ...
#5 32.73 Setting up gperf (3.1-1) ...
#5 32.87 Setting up python3-wheel (0.32.3-2) ...
#5 33.08 Setting up libltdl-dev:amd64 (2.4.6-9) ...
#5 33.24 Setting up libxml-sax-base-perl (1.09-1) ...
#5 33.37 Setting up libexpat1-dev:amd64 (2.2.6-2+deb10u7) ...
#5 33.66 Setting up dbus (1.12.28-0+deb10u1) ...
#5 34.61 invoke-rc.d: could not determine current runlevel
#5 34.61 invoke-rc.d: policy-rc.d denied execution of start.
#5 34.66 Setting up ucf (3.0038+nmu1) ...
#5 34.88 debconf: unable to initialize frontend: Dialog
#5 34.88 debconf: (TERM is not set, so the dialog frontend is not usable.)
#5 34.88 debconf: falling back to frontend: Readline
#5 34.97 Setting up python3-crypto (2.6.1-9+b1) ...
#5 36.54 Setting up libgirepository-1.0-1:amd64 (1.58.3-2) ...
#5 36.67 Setting up python-pip-whl (18.1-5) ...
#5 36.81 Setting up libtext-unidecode-perl (1.30-1) ...
#5 36.92 Setting up libgc-dev:amd64 (1:7.6.4-0.4) ...
#5 37.05 Setting up python3-asn1crypto (0.24.0-1) ...
#5 37.27 Setting up tcsh (6.20.00-7+b1) ...
#5 37.60 update-alternatives: using /bin/tcsh to provide /bin/csh (csh) in auto mode
#5 37.66 Setting up python3-cffi-backend (1.12.2-1) ...
#5 37.79 Setting up libpython3.7-dev:amd64 (3.7.3-2+deb10u7) ...
#5 37.92 Setting up libxml-sax-perl (1.00+dfsg-1) ...
#5 39.34 update-perl-sax-parsers: Registering Perl SAX parser XML::SAX::PurePerl with priority 10...
#5 39.37 update-perl-sax-parsers: Updating overall Perl SAX parser modules info file...
#5 39.42 debconf: unable to initialize frontend: Dialog
#5 39.42 debconf: (TERM is not set, so the dialog frontend is not usable.)
#5 39.42 debconf: falling back to frontend: Readline
#5 39.44 
#5 39.44 Creating config file /etc/perl/XML/SAX/ParserDetails.ini with new version
#5 39.51 Setting up python3.7-dev (3.7.3-2+deb10u7) ...
#5 39.64 Setting up tex-common (6.11) ...
#5 39.83 debconf: unable to initialize frontend: Dialog
#5 39.83 debconf: (TERM is not set, so the dialog frontend is not usable.)
#5 39.83 debconf: falling back to frontend: Readline
#5 39.87 update-language: texlive-base not installed and configured, doing nothing!
#5 40.14 Setting up python3-cryptography (2.6.1-3+deb10u4) ...
#5 40.48 Setting up gir1.2-glib-2.0:amd64 (1.58.3-2) ...
#5 40.60 Setting up python3-pip (18.1-5) ...
#5 40.83 Setting up libxml-libxml-perl (2.0134+dfsg-1) ...
#5 40.92 update-perl-sax-parsers: Registering Perl SAX parser XML::LibXML::SAX::Parser with priority 50...
#5 40.96 update-perl-sax-parsers: Registering Perl SAX parser XML::LibXML::SAX with priority 50...
#5 40.99 update-perl-sax-parsers: Updating overall Perl SAX parser modules info file...
#5 41.04 debconf: unable to initialize frontend: Dialog
#5 41.04 debconf: (TERM is not set, so the dialog frontend is not usable.)
#5 41.04 debconf: falling back to frontend: Readline
#5 41.07 Replacing config file /etc/perl/XML/SAX/ParserDetails.ini with new version
#5 41.15 Setting up libxml-sax-expat-perl (0.51-1) ...
#5 41.27 update-perl-sax-parsers: Registering Perl SAX parser XML::SAX::Expat with priority 50...
#5 41.29 update-perl-sax-parsers: Updating overall Perl SAX parser modules info file...
#5 41.34 debconf: unable to initialize frontend: Dialog
#5 41.34 debconf: (TERM is not set, so the dialog frontend is not usable.)
#5 41.34 debconf: falling back to frontend: Readline
#5 41.37 Replacing config file /etc/perl/XML/SAX/ParserDetails.ini with new version
#5 41.45 Setting up python3-keyrings.alt (3.1.1-1) ...
#5 41.64 Setting up guile-2.0-dev (2.0.13+1-5.1) ...
#5 41.77 Setting up libpython3-dev:amd64 (3.7.3-1) ...
#5 41.90 Setting up python3-secretstorage (2.3.1-2) ...
#5 42.11 Setting up python3-dev (3.7.3-1) ...
#5 42.23 Setting up python3-gi (3.30.4-1) ...
#5 42.43 Setting up texinfo (6.5.0.dfsg.1-4+b1) ...
#5 42.59 Setting up gnulib (20140202+stable-4) ...
#5 42.71 Setting up python3-keyring (17.1.1-1) ...
#5 42.89 Processing triggers for man-db (2.8.5-2+deb10u1) ...
#5 43.22 Processing triggers for libc-bin (2.28-10+deb10u4) ...
#5 DONE 47.3s

#6 [3/4] RUN	PIP3 install junit-xml
#6 1.090 Collecting junit-xml
#6 1.149   Downloading https://files.pythonhosted.org/packages/2a/93/2d896b5fd3d79b4cadd8882c06650e66d003f465c9d12c488d92853dff78/junit_xml-1.9-py2.py3-none-any.whl
#6 1.157 Requirement already satisfied: six in /usr/lib/python3/dist-packages (from junit-xml) (1.12.0)
#6 1.166 Installing collected packages: junit-xml
#6 1.171 Successfully installed junit-xml-1.9
#6 DONE 1.3s

#7 [4/4] RUN	CD /tmp && git clone https://github.com/nplab/guile-sctp && 	cd guile-sctp && 	./bootstrap && 	./configure && 	make && 	make install
#7 0.643 Cloning into 'guile-sctp'...
#7 1.015 + [ -e /usr/local/bin/glibtoolize ]
#7 1.015 + [ -e /usr/bin/glibtoolize ]
#7 1.015 + [ -e /usr/local/bin/libtoolize ]
#7 1.015 + [ -e /usr/bin/libtoolize ]
#7 1.015 + /usr/bin/libtoolize --force
#7 1.105 libtoolize: putting auxiliary files in '.'.
#7 1.105 libtoolize: linking file './ltmain.sh'
#7 1.117 libtoolize: putting macros in AC_CONFIG_MACRO_DIRS, 'm4'.
#7 1.117 libtoolize: linking file 'm4/libtool.m4'
#7 1.120 libtoolize: linking file 'm4/ltoptions.m4'
#7 1.123 libtoolize: linking file 'm4/ltsugar.m4'
#7 1.126 libtoolize: linking file 'm4/ltversion.m4'
#7 1.128 libtoolize: linking file 'm4/lt~obsolete.m4'
#7 1.131 + [ -e /usr/local/share/aclocal ]
#7 1.131 + aclocal
#7 2.501 + autoheader
#7 2.661 + autoconf
#7 2.765 + automake --foreign --add-missing --copy
#7 3.002 configure.ac:12: installing './compile'
#7 3.003 configure.ac:11: installing './config.guess'
#7 3.004 configure.ac:11: installing './config.sub'
#7 3.005 configure.ac:7: installing './install-sh'
#7 3.006 configure.ac:7: installing './missing'
#7 3.012 Makefile.am: installing './depcomp'
#7 3.082 checking for a BSD-compatible install... /usr/bin/install -c
#7 3.086 checking whether build environment is sane... yes
#7 3.091 checking for a thread-safe mkdir -p... /bin/mkdir -p
#7 3.092 checking for gawk... gawk
#7 3.092 checking whether make sets $(MAKE)... yes
#7 3.098 checking whether make supports nested variables... yes
#7 3.109 checking build system type... x86_64-pc-linux-gnu
#7 3.137 checking host system type... x86_64-pc-linux-gnu
#7 3.137 checking for gcc... gcc
#7 3.151 checking whether the C compiler works... yes
#7 3.169 checking for C compiler default output file name... a.out
#7 3.170 checking for suffix of executables... 
#7 3.189 checking whether we are cross compiling... no
#7 3.210 checking for suffix of object files... o
#7 3.223 checking whether we are using the GNU C compiler... yes
#7 3.234 checking whether gcc accepts -g... yes
#7 3.245 checking for gcc option to accept ISO C89... none needed
#7 3.261 checking whether gcc understands -c and -o together... yes
#7 3.280 checking whether make supports the include directive... yes (GNU style)
#7 3.284 checking dependency style of gcc... gcc3
#7 3.301 checking how to print strings... printf
#7 3.316 checking for a sed that does not truncate output... /bin/sed
#7 3.319 checking for grep that handles long lines and -e... /bin/grep
#7 3.320 checking for egrep... /bin/grep -E
#7 3.321 checking for fgrep... /bin/grep -F
#7 3.322 checking for ld used by gcc... /usr/bin/ld
#7 3.324 checking if the linker (/usr/bin/ld) is GNU ld... yes
#7 3.325 checking for BSD- or MS-compatible name lister (nm)... /usr/bin/nm -B
#7 3.326 checking the name lister (/usr/bin/nm -B) interface... BSD nm
#7 3.337 checking whether ln -s works... yes
#7 3.337 checking the maximum length of command line arguments... 1572864
#7 3.341 checking how to convert x86_64-pc-linux-gnu file names to x86_64-pc-linux-gnu format... func_convert_file_noop
#7 3.341 checking how to convert x86_64-pc-linux-gnu file names to toolchain format... func_convert_file_noop
#7 3.341 checking for /usr/bin/ld option to reload object files... -r
#7 3.341 checking for objdump... objdump
#7 3.341 checking how to recognize dependent libraries... pass_all
#7 3.342 checking for dlltool... no
#7 3.342 checking how to associate runtime and link libraries... printf %s\n
#7 3.342 checking for ar... ar
#7 3.342 checking for archiver @FILE support... @
#7 3.357 checking for strip... strip
#7 3.357 checking for ranlib... ranlib
#7 3.357 checking command to parse /usr/bin/nm -B output from gcc object... ok
#7 3.401 checking for sysroot... no
#7 3.401 checking for a working dd... /bin/dd
#7 3.404 checking how to truncate binary pipes... /bin/dd bs=4096 count=1
#7 3.417 checking for mt... no
#7 3.417 checking if : is a manifest tool... no
#7 3.420 checking how to run the C preprocessor... gcc -E
#7 3.469 checking for ANSI C header files... yes
#7 3.529 checking for sys/types.h... yes
#7 3.545 checking for sys/stat.h... yes
#7 3.562 checking for stdlib.h... yes
#7 3.578 checking for string.h... yes
#7 3.595 checking for memory.h... yes
#7 3.611 checking for strings.h... yes
#7 3.628 checking for inttypes.h... yes
#7 3.646 checking for stdint.h... yes
#7 3.663 checking for unistd.h... yes
#7 3.681 checking for dlfcn.h... yes
#7 3.697 checking for objdir... .libs
#7 3.732 checking if gcc supports -fno-rtti -fno-exceptions... no
#7 3.743 checking for gcc option to produce PIC... -fPIC -DPIC
#7 3.743 checking if gcc PIC flag -fPIC -DPIC works... yes
#7 3.755 checking if gcc static flag -static works... yes
#7 3.784 checking if gcc supports -c -o file.o... yes
#7 3.798 checking if gcc supports -c -o file.o... (cached) yes
#7 3.798 checking whether the gcc linker (/usr/bin/ld -m elf_x86_64) supports shared libraries... yes
#7 3.803 checking whether -lc should be explicitly linked in... no
#7 3.820 checking dynamic linker characteristics... GNU/Linux ld.so
#7 3.849 checking how to hardcode library paths into programs... immediate
#7 3.849 checking whether stripping libraries is possible... yes
#7 3.849 checking if libtool supports shared libraries... yes
#7 3.850 checking whether to build shared libraries... yes
#7 3.850 checking whether to build static libraries... yes
#7 3.850 checking for pkg-config... /usr/bin/pkg-config
#7 3.850 checking pkg-config is at least version 0.9.0... yes
#7 3.851 configure: checking for guile 2.0
#7 3.852 configure: found guile 2.0
#7 3.852 checking for ld used by gcc... /usr/bin/ld -m elf_x86_64
#7 3.854 checking if the linker (/usr/bin/ld -m elf_x86_64) is GNU ld... yes
#7 3.855 checking for shared library run path origin... done
#7 3.860 checking for GUILE... yes
#7 3.864 checking for Guile site directory... /usr/share/guile/site/2.0
#7 3.867 checking for sys/types.h... (cached) yes
#7 3.870 checking sys/socket.h usability... yes
#7 3.886 checking sys/socket.h presence... yes
#7 3.892 checking for sys/socket.h... yes
#7 3.895 checking netinet/in.h usability... yes
#7 3.911 checking netinet/in.h presence... yes
#7 3.918 checking for netinet/in.h... yes
#7 3.921 checking netinet/sctp.h usability... yes
#7 3.938 checking netinet/sctp.h presence... yes
#7 3.945 checking for netinet/sctp.h... yes
#7 3.947 checking whether byte ordering is bigendian... no
#7 3.983 checking for working IPv6 support... yes
#7 3.998 checking whether sockaddr_in6 has sin6_scope_id... yes
#7 4.012 checking for struct sockaddr.sa_len... no
#7 4.037 checking for struct sockaddr_in.sin_len... no
#7 4.064 checking for struct sockaddr_in6.sin6_len... no
#7 4.087 checking for sctp_sendmsg in -lsctp... yes
#7 4.108 checking for sctp_recvmsg in -lsctp... yes
#7 4.130 checking for sctp_sendmsg... yes
#7 4.154 checking for sctp_recvmsg... yes
#7 4.187 checking that generated files are newer than configure... done
#7 4.187 configure: creating ./config.status
#7 4.413 config.status: creating Makefile
#7 4.419 config.status: creating config.h
#7 4.424 config.status: executing depfiles commands
#7 4.431 config.status: executing libtool commands
#7 4.450 guile-snarf -o guile-sctp.x -DHAVE_CONFIG_H  -pthread -I/usr/include/guile/2.0 -g -O2 guile-sctp.c
#7 4.474 make  all-am
#7 4.475 make[1]: Entering directory '/tmp/guile-sctp'
#7 4.475 /bin/bash ./libtool  --tag=CC   --mode=compile gcc -DHAVE_CONFIG_H -I.  -pthread -I/usr/include/guile/2.0   -g -O2 -MT guile-sctp.lo -MD -MP -MF .deps/guile-sctp.Tpo -c -o guile-sctp.lo guile-sctp.c
#7 4.490 libtool: compile:  gcc -DHAVE_CONFIG_H -I. -pthread -I/usr/include/guile/2.0 -g -O2 -MT guile-sctp.lo -MD -MP -MF .deps/guile-sctp.Tpo -c guile-sctp.c  -fPIC -DPIC -o .libs/guile-sctp.o
#7 4.560 libtool: compile:  gcc -DHAVE_CONFIG_H -I. -pthread -I/usr/include/guile/2.0 -g -O2 -MT guile-sctp.lo -MD -MP -MF .deps/guile-sctp.Tpo -c guile-sctp.c -o guile-sctp.o >/dev/null 2>&1
#7 4.632 mv -f .deps/guile-sctp.Tpo .deps/guile-sctp.Plo
#7 4.633 /bin/bash ./libtool  --tag=CC   --mode=link gcc  -g -O2   -o libguile-net-sctp.la -rpath /usr/local/lib guile-sctp.lo  -lsctp -lsctp 
#7 4.665 libtool: link: gcc -shared  -fPIC -DPIC  .libs/guile-sctp.o   -lsctp  -g -O2   -Wl,-soname -Wl,libguile-net-sctp.so.0 -o .libs/libguile-net-sctp.so.0.0.0
#7 4.676 libtool: link: (cd ".libs" && rm -f "libguile-net-sctp.so.0" && ln -s "libguile-net-sctp.so.0.0.0" "libguile-net-sctp.so.0")
#7 4.679 libtool: link: (cd ".libs" && rm -f "libguile-net-sctp.so" && ln -s "libguile-net-sctp.so.0.0.0" "libguile-net-sctp.so")
#7 4.681 libtool: link: ar cru .libs/libguile-net-sctp.a  guile-sctp.o
#7 4.681 ar: `u' modifier ignored since `D' is the default (see `U')
#7 4.682 libtool: link: ranlib .libs/libguile-net-sctp.a
#7 4.687 libtool: link: ( cd ".libs" && rm -f "libguile-net-sctp.la" && ln -s "../libguile-net-sctp.la" "libguile-net-sctp.la" )
#7 4.688 make[1]: Leaving directory '/tmp/guile-sctp'
#7 4.690 make  install-am
#7 4.696 make[1]: Entering directory '/tmp/guile-sctp'
#7 4.703 make[2]: Entering directory '/tmp/guile-sctp'
#7 4.703  /bin/mkdir -p '/usr/local/lib'
#7 4.704  /bin/bash ./libtool   --mode=install /usr/bin/install -c   libguile-net-sctp.la '/usr/local/lib'
#7 4.717 libtool: install: /usr/bin/install -c .libs/libguile-net-sctp.so.0.0.0 /usr/local/lib/libguile-net-sctp.so.0.0.0
#7 4.718 libtool: install: (cd /usr/local/lib && { ln -s -f libguile-net-sctp.so.0.0.0 libguile-net-sctp.so.0 || { rm -f libguile-net-sctp.so.0 && ln -s libguile-net-sctp.so.0.0.0 libguile-net-sctp.so.0; }; })
#7 4.718 libtool: install: (cd /usr/local/lib && { ln -s -f libguile-net-sctp.so.0.0.0 libguile-net-sctp.so || { rm -f libguile-net-sctp.so && ln -s libguile-net-sctp.so.0.0.0 libguile-net-sctp.so; }; })
#7 4.719 libtool: install: /usr/bin/install -c .libs/libguile-net-sctp.lai /usr/local/lib/libguile-net-sctp.la
#7 4.720 libtool: install: /usr/bin/install -c .libs/libguile-net-sctp.a /usr/local/lib/libguile-net-sctp.a
#7 4.721 libtool: install: chmod 644 /usr/local/lib/libguile-net-sctp.a
#7 4.721 libtool: install: ranlib /usr/local/lib/libguile-net-sctp.a
#7 4.741 libtool: finish: PATH="/usr/local/sbin:/usr/local/bin:/usr/sbin:/usr/bin:/sbin:/bin:/sbin" ldconfig -n /usr/local/lib
#7 4.742 ----------------------------------------------------------------------
#7 4.742 Libraries have been installed in:
#7 4.742    /usr/local/lib
#7 4.742 
#7 4.742 If you ever happen to want to link against installed libraries
#7 4.742 in a given directory, LIBDIR, you must either use libtool, and
#7 4.742 specify the full pathname of the library, or use the '-LLIBDIR'
#7 4.742 flag during linking and do at least one of the following:
#7 4.742    - add LIBDIR to the 'LD_LIBRARY_PATH' environment variable
#7 4.742      during execution
#7 4.742    - add LIBDIR to the 'LD_RUN_PATH' environment variable
#7 4.742      during linking
#7 4.742    - use the '-Wl,-rpath -Wl,LIBDIR' linker flag
#7 4.742    - have your system administrator add LIBDIR to '/etc/ld.so.conf'
#7 4.742 
#7 4.742 See any operating system documentation about shared libraries for
#7 4.742 more information, such as the ld(1) and ld.so(8) manual pages.
#7 4.742 ----------------------------------------------------------------------
#7 4.743  /bin/mkdir -p '/usr/share/guile/site/2.0/net'
#7 4.745  /usr/bin/install -c -m 644 sctp.scm '/usr/share/guile/site/2.0/net'
#7 4.746 make[2]: Leaving directory '/tmp/guile-sctp'
#7 4.746 make[1]: Leaving directory '/tmp/guile-sctp'
#7 DONE 5.1s

#8 exporting to image
#8 exporting layers
#8 exporting layers 1.3s done
#8 writing image sha256:73dcc54ffdf0b4acfe331bd8b75bbf5da131388aa2d097bbc7fb740be4a6e271 0.0s done
#8 naming to docker.io/osmocom-build/sigtran-tests:latest 0.0s done
#8 DONE 1.5s

 1 warning found (use docker --debug to expand):
 - InvalidDefaultArgInFrom: Default value for ARG $USER/debian-buster-build results in empty or invalid base image name (line 5)
rm -rf .common
make: Leaving directory '/home/osmocom-build/jenkins/workspace/nplab-m3ua-test/sigtran-tests'
+ docker_image_exists sigtran-tests
+ docker images -q osmocom-build/sigtran-tests
+ test -n 73dcc54ffdf0
+ list_osmo_packages debian-bookworm sigtran-tests
+ local distro=debian-bookworm
+ local image=sigtran-tests
+ local docker_run_sh=docker run --rm --entrypoint=/bin/sh osmocom-build/sigtran-tests -c
+ [ -n  ]
+ return
+ [ registry.osmocom.org = registry.osmocom.org ]
+ docker_depends osmo-stp-master
+ local feed
+ echo debian-bookworm-build
+ depends=debian-bookworm-build
+ [ -n debian-bookworm-build ]
+ docker_images_require debian-bookworm-build
+ local i
+ local from_line
+ local pull_arg
+ local upstream_distro_arg
+ local distro_arg
+ local depends
+ local dir
+ [ registry.osmocom.org = registry.osmocom.org ]
+ docker_depends debian-bookworm-build
+ local feed
+ depends=
+ [ -n  ]
+ docker_distro_from_image_name debian-bookworm-build
+ echo debian-bookworm
+ distro_arg=debian-bookworm
+ [ -z  ]
+ docker_upstream_distro_from_image_name debian-bookworm-build
+ echo debian:bookworm
+ upstream_distro_arg=debian:bookworm
+ docker_dir_from_image_name debian-bookworm-build
+ echo debian-bookworm-build
+ dir=debian-bookworm-build
+ [ -z  ]
+ pull_arg=--pull
+ grep ^FROM ../debian-bookworm-build/Dockerfile
+ from_line=FROM	${REGISTRY}/${UPSTREAM_DISTRO}
+ echo FROM	${REGISTRY}/${UPSTREAM_DISTRO}
+ grep -q $USER
+ set +x
Building image: debian-bookworm-build (export NO_DOCKER_IMAGE_BUILD=1 to prevent this)
+ docker_osmo_ttcn3_branch
+ [ -n  ]
+ echo master
+ make -C ../debian-bookworm-build BUILD_ARGS=--pull UPSTREAM_DISTRO=debian:bookworm DISTRO=debian-bookworm IMAGE=osmocom-build/debian-bookworm-build OSMO_TTCN3_BRANCH=master
make: Entering directory '/home/osmocom-build/jenkins/workspace/nplab-m3ua-test/debian-bookworm-build'
awk: fatal: cannot open file `.release' for reading: No such file or directory
awk: fatal: cannot open file `.release' for reading: No such file or directory
awk: fatal: cannot open file `.release' for reading: No such file or directory
rm -rf .common
cp -r /home/osmocom-build/jenkins/workspace/nplab-m3ua-test/common .common
INFO: .release created
release=0.0.0
docker build \
	--build-arg USER=osmocom-build \
	--build-arg UID=1000 \
	--build-arg REGISTRY=registry.osmocom.org \
	--build-arg OSMO_TTCN3_BRANCH=master \
	--build-arg UPSTREAM_DISTRO=debian:bookworm \
	--build-arg DISTRO=debian-bookworm \
	--build-arg OSMOCOM_REPO_MIRROR=https://downloads.osmocom.org \
	--build-arg OSMOCOM_REPO_PATH=packages/osmocom: \
	--build-arg OSMOCOM_REPO_VERSION=latest \
	--build-arg OSMOCOM_REPO_TESTSUITE_MIRROR=https://downloads.osmocom.org \
	--build-arg ASTERISK_BRANCH=sysmocom/20.7.0 \
	--build-arg LIBOSMOCORE_BRANCH=master \
	--build-arg OSMO_BB_BRANCH=master \
	--build-arg OSMO_BSC_BRANCH=master \
	--build-arg OSMO_BTS_BRANCH=master \
	--build-arg OSMO_CBC_BRANCH=master \
	--build-arg OSMO_DIA2GSUP_BRANCH=master \
	--build-arg OSMO_EPDG_BRANCH=master \
	--build-arg OSMO_GBPROXY_BRANCH=master \
	--build-arg OSMO_GGSN_BRANCH=master \
	--build-arg OSMO_GSM_TESTER_BRANCH=master \
	--build-arg OSMO_HLR_BRANCH=master \
	--build-arg OSMO_HNBGW_BRANCH=master \
	--build-arg OSMO_HNODEB_BRANCH=master \
	--build-arg OSMO_IUH_BRANCH=master \
	--build-arg OSMO_MGW_BRANCH=master \
	--build-arg OSMO_MSC_BRANCH=master \
	--build-arg OSMO_NITB_BRANCH=master \
	--build-arg OSMO_PCU_BRANCH=master \
	--build-arg OSMO_REMSIM_BRANCH=master \
	--build-arg OSMO_SGSN_BRANCH=master \
	--build-arg OSMO_SIP_BRANCH=master \
	--build-arg OSMO_STP_BRANCH=master \
	--build-arg OSMO_UECUPS_BRANCH=master \
	--build-arg OPEN5GS_BRANCH=main \
	--build-arg PJPROJECT_BRANCH=sysmocom/2.14 \
	--pull -t osmocom-build/debian-bookworm-build:latest .
#0 building with "default" instance using docker driver

#1 [internal] load build definition from Dockerfile
#1 transferring dockerfile: 5.80kB done
#1 DONE 0.1s

#2 [auth] sharing credentials for registry.osmocom.org
#2 DONE 0.0s

#3 [internal] load metadata for registry.osmocom.org/debian:bookworm
#3 DONE 0.1s

#4 [internal] load .dockerignore
#4 transferring context: 2B done
#4 DONE 0.1s

#5 [internal] load build context
#5 DONE 0.0s

#6 [15/16] ADD	HTTPS://DOWNLOADS.OSMOCOM.ORG/PACKAGES/OSMOCOM:/NIGHTLY/DEBIAN_12//RELEASE /tmp/Release
#6 DONE 0.1s

#7 [ 1/16] FROM registry.osmocom.org/debian:bookworm@sha256:30c92cee105dd5e0b358aad92c408f38bae576fd60da2310538f86ea7e9d23c2
#7 resolve registry.osmocom.org/debian:bookworm@sha256:30c92cee105dd5e0b358aad92c408f38bae576fd60da2310538f86ea7e9d23c2
#7 ...

#8 [ 7/16] ADD	HTTPS://GITEA.OSMOCOM.ORG/SIM-CARD/PYSIM/RAW/BRANCH/MASTER/REQUIREMENTS.TXT /tmp/pysim_requirements.txt
#8 DONE 0.2s

#7 [ 1/16] FROM registry.osmocom.org/debian:bookworm@sha256:30c92cee105dd5e0b358aad92c408f38bae576fd60da2310538f86ea7e9d23c2
#7 resolve registry.osmocom.org/debian:bookworm@sha256:30c92cee105dd5e0b358aad92c408f38bae576fd60da2310538f86ea7e9d23c2 0.3s done
#7 DONE 0.3s

#9 [13/16] ADD	HTTPS://GERRIT.OSMOCOM.ORG/PLUGINS/GITILES/OSMO-GSM-MANUALS/+/MASTER?FORMAT=TEXT /tmp/osmo-gsm-manuals-commit
#9 DONE 0.3s

#10 [ 9/16] ADD	HTTPS://GERRIT.OSMOCOM.ORG/PLUGINS/GITILES/PYTHON/OSMO-PYTHON-TESTS/+/MASTER?FORMAT=TEXT /tmp/osmo-python-tests-commit
#10 DONE 0.6s

#11 [11/16] ADD	HTTPS://GERRIT.OSMOCOM.ORG/PLUGINS/GITILES/OSMO-CI/+/MASTER?FORMAT=TEXT /tmp/osmo-ci-commit
#11 DONE 0.7s

#6 [15/16] ADD	HTTPS://DOWNLOADS.OSMOCOM.ORG/PACKAGES/OSMOCOM:/NIGHTLY/DEBIAN_12//RELEASE /tmp/Release
#6 CACHED

#5 [internal] load build context
#5 transferring context: 1.96kB done
#5 DONE 0.1s

#12 [ 3/16] COPY	.COMMON/RELEASE.KEY /etc/apt/trusted.gpg.d/obs.osmocom.org.asc
#12 CACHED

#13 [ 4/16] RUN	SET -x && 	useradd --uid=1000 -d /build -m build && 	chown -R build:build /usr/local && 		echo "path-exclude=/usr/share/man/*" 		> /etc/dpkg/dpkg.cfg.d/exclude-man-pages && 	rm -rf /usr/share/man/
#13 CACHED

#14 [ 5/16] RUN	IF [ "$(arch)" != "x86_64" ]; then 		echo "ERROR: use debian-bookworm-build-arm instead"; 		exit 1; 	fi && 	set -x && 	apt-get update && 	apt-get install -y --no-install-recommends 		ca-certificates 		libtinfo5 		wget 		&& 	apt-get clean && 	wget https://github.com/ARM-software/LLVM-embedded-toolchain-for-Arm/releases/download/release-14.0.0/LLVMEmbeddedToolchainForArm-14.0.0-linux.tar.gz && 	tar -xf LLVMEmbeddedToolchainForArm-14.0.0-linux.tar.gz && 	rm LLVMEmbeddedToolchainForArm-14.0.0-linux.tar.gz && 	mv LLVMEmbeddedToolchainForArm-14.0.0 /opt/llvm-arm && 	/opt/llvm-arm/bin/clang --version && 	/opt/llvm-arm/bin/clang --print-targets
#14 CACHED

#15 [ 6/16] RUN	SET -x && 	apt-get update && 	apt-get install -y --no-install-recommends 		asciidoc 		asciidoc-dblatex 		autoconf 		autoconf-archive 		autogen 		automake 		bc 		bison 		build-essential 		bzip2 		ca-certificates 		ccache 		clang-format 		cmake 		coccinelle 		cppcheck 		curl 		dahdi-source 		dblatex 		dbus 		debhelper 		devscripts 		dh-autoreconf 		docbook5-xml 		doxygen 		equivs 		flex 		g++ 		gawk 		gcc 		gcc-arm-none-eabi 		ghostscript 		git 		gnupg 		graphviz 		htop 		iproute2 		latexmk 		lcov 		libaio-dev 		libasound2-dev 		libbladerf-dev 		libboost-all-dev 		libc-ares-dev 		libcdk5-dev 		libcsv-dev 		libdbd-sqlite3 		libdbi-dev 		libelf-dev 		libffi-dev 		libfftw3-dev 		libgmp-dev 		libgnutls28-dev 		libgps-dev 		libgsm1-dev 		libjansson-dev 		liblua5.3-dev 		libmnl-dev 		libncurses5-dev 		libnewlib-arm-none-eabi 		libnftables-dev 		libnftnl-dev 		libnl-3-dev 		libnl-route-3-dev 		liboping-dev 		libortp-dev 		libpcap-dev 		libpcsclite-dev 		libreadline-dev 		librsvg2-bin 		libsctp-dev 		libsigsegv-dev 		libsnmp-dev 		libsofia-sip-ua-glib-dev 		libsqlite3-dev 		libssl-dev 		libtalloc-dev 		libtinfo5 		libtool 		liburing-dev 		libusb-1.0-0-dev 		libusb-dev 		libxml2-utils 		libzmq3-dev 		locales 		lua-socket 		make 		mscgen 		ofono 		openssh-client 		patchelf 		picolibc-arm-none-eabi 		pkg-config 		pylint 		python3 		python3-gi 		python3-mako 		python3-nwdiag 		python3-pip 		python3-pyflakes 		python3-setuptools 		python3-usb 		python3-yaml 		rsync 		sdcc 		source-highlight 		sqlite3 		stow 		sudo 		swig 		systemd 		tcpdump 		telnet 		tex-gyre 		texinfo 		unzip 		virtualenv 		xsltproc 		xxd 		&& 	apt-get clean
#15 CACHED

#16 [ 2/16] COPY	.COMMON/RESPAWN.SH /usr/local/bin/respawn.sh
#16 CACHED

#17 [ 7/16] ADD	HTTPS://GITEA.OSMOCOM.ORG/SIM-CARD/PYSIM/RAW/BRANCH/MASTER/REQUIREMENTS.TXT /tmp/pysim_requirements.txt
#17 CACHED

#10 [ 9/16] ADD	HTTPS://GERRIT.OSMOCOM.ORG/PLUGINS/GITILES/PYTHON/OSMO-PYTHON-TESTS/+/MASTER?FORMAT=TEXT /tmp/osmo-python-tests-commit
#10 CACHED

#11 [11/16] ADD	HTTPS://GERRIT.OSMOCOM.ORG/PLUGINS/GITILES/OSMO-CI/+/MASTER?FORMAT=TEXT /tmp/osmo-ci-commit
#11 CACHED

#9 [13/16] ADD	HTTPS://GERRIT.OSMOCOM.ORG/PLUGINS/GITILES/OSMO-GSM-MANUALS/+/MASTER?FORMAT=TEXT /tmp/osmo-gsm-manuals-commit
#9 CACHED

#18 [ 8/16] RUN	SET -x && 	cat /tmp/pysim_requirements.txt && 	pip3 install --break-system-packages 		'git+https://github.com/eriwen/lcov-to-cobertura-xml.git' 		'git+https://github.com/osmocom/sphinx-argparse@inside-classes#egg=sphinx-argparse' 		'git+https://github.com/podshumok/python-smpplib.git' 		'pydbus' 		'pysispm' 		'ruff' 		'sphinx' 		'sphinxcontrib-napoleon' 		-r /tmp/pysim_requirements.txt
#18 0.571 + cat /tmp/pysim_requirements.txt
#18 0.571 pyscard
#18 0.571 pyserial
#18 0.571 pytlv
#18 0.571 cmd2>=1.5
#18 0.571 jsonpath-ng
#18 0.571 construct>=2.10.70
#18 0.571 bidict
#18 0.571 pyosmocom>=0.0.8
#18 0.571 pyyaml>=5.1
#18 0.571 termcolor
#18 0.571 colorlog
#18 0.571 pycryptodomex
#18 0.571 cryptography
#18 0.571 git+https://github.com/osmocom/asn1tools
#18 0.571 packaging
#18 0.571 git+https://github.com/hologram-io/smpp.pdu
#18 0.571 + pip3 install --break-system-packages git+https://github.com/eriwen/lcov-to-cobertura-xml.git git+https://github.com/osmocom/sphinx-argparse@inside-classes#egg=sphinx-argparse git+https://github.com/podshumok/python-smpplib.git pydbus pysispm ruff sphinx sphinxcontrib-napoleon -r /tmp/pysim_requirements.txt
#18 0.783 Collecting git+https://github.com/eriwen/lcov-to-cobertura-xml.git
#18 0.783   Cloning https://github.com/eriwen/lcov-to-cobertura-xml.git to /tmp/pip-req-build-34d05ak1
#18 0.784   Running command git clone --filter=blob:none --quiet https://github.com/eriwen/lcov-to-cobertura-xml.git /tmp/pip-req-build-34d05ak1
#18 1.604   Resolved https://github.com/eriwen/lcov-to-cobertura-xml.git to commit 85f51dfd646fadf534ce2bd636befeec37148ff9
#18 1.606   Installing build dependencies: started
#18 3.078   Installing build dependencies: finished with status 'done'
#18 3.079   Getting requirements to build wheel: started
#18 3.205   Getting requirements to build wheel: finished with status 'error'
#18 3.210   error: subprocess-exited-with-error
#18 3.210   
#18 3.210   × Getting requirements to build wheel did not run successfully.
#18 3.210   │ exit code: 1
#18 3.210   ╰─> [28 lines of output]
#18 3.210       Traceback (most recent call last):
#18 3.210         File "/usr/lib/python3/dist-packages/pip/_vendor/pyproject_hooks/_in_process/_in_process.py", line 353, in <module>
#18 3.210           main()
#18 3.210         File "/usr/lib/python3/dist-packages/pip/_vendor/pyproject_hooks/_in_process/_in_process.py", line 335, in main
#18 3.210           json_out['return_val'] = hook(**hook_input['kwargs'])
#18 3.210                                    ^^^^^^^^^^^^^^^^^^^^^^^^^^^^
#18 3.210         File "/usr/lib/python3/dist-packages/pip/_vendor/pyproject_hooks/_in_process/_in_process.py", line 118, in get_requires_for_build_wheel
#18 3.210           return hook(config_settings)
#18 3.210                  ^^^^^^^^^^^^^^^^^^^^^
#18 3.210         File "/tmp/pip-build-env-0vgy1p2y/overlay/local/lib/python3.11/dist-packages/setuptools/build_meta.py", line 334, in get_requires_for_build_wheel
#18 3.210           return self._get_build_requires(config_settings, requirements=[])
#18 3.210                  ^^^^^^^^^^^^^^^^^^^^^^^^^^^^^^^^^^^^^^^^^^^^^^^^^^^^^^^^^^
#18 3.210         File "/tmp/pip-build-env-0vgy1p2y/overlay/local/lib/python3.11/dist-packages/setuptools/build_meta.py", line 304, in _get_build_requires
#18 3.210           self.run_setup()
#18 3.210         File "/tmp/pip-build-env-0vgy1p2y/overlay/local/lib/python3.11/dist-packages/setuptools/build_meta.py", line 320, in run_setup
#18 3.210           exec(code, locals())
#18 3.210         File "<string>", line 3, in <module>
#18 3.210         File "/tmp/pip-build-env-0vgy1p2y/overlay/local/lib/python3.11/dist-packages/setuptools/__init__.py", line 116, in setup
#18 3.210           _install_setup_requires(attrs)
#18 3.210         File "/tmp/pip-build-env-0vgy1p2y/overlay/local/lib/python3.11/dist-packages/setuptools/__init__.py", line 87, in _install_setup_requires
#18 3.210           dist.parse_config_files(ignore_option_errors=True)
#18 3.210         File "/tmp/pip-build-env-0vgy1p2y/overlay/local/lib/python3.11/dist-packages/setuptools/dist.py", line 759, in parse_config_files
#18 3.210           self._finalize_license_expression()
#18 3.210         File "/tmp/pip-build-env-0vgy1p2y/overlay/local/lib/python3.11/dist-packages/setuptools/dist.py", line 432, in _finalize_license_expression
#18 3.210           raise InvalidConfigError(
#18 3.210       setuptools.errors.InvalidConfigError: License classifiers have been superseded by license expressions (see https://peps.python.org/pep-0639/). Please remove:
#18 3.210       
#18 3.210       License :: OSI Approved :: Apache Software License
#18 3.210       [end of output]
#18 3.210   
#18 3.210   note: This error originates from a subprocess, and is likely not a problem with pip.
#18 3.211 error: subprocess-exited-with-error
#18 3.211 
#18 3.211 × Getting requirements to build wheel did not run successfully.
#18 3.211 │ exit code: 1
#18 3.211 ╰─> See above for output.
#18 3.211 
#18 3.211 note: This error originates from a subprocess, and is likely not a problem with pip.
#18 ERROR: process "/bin/sh -c set -x && \tcat /tmp/pysim_requirements.txt && \tpip3 install --break-system-packages \t\t'git+https://github.com/eriwen/lcov-to-cobertura-xml.git' \t\t'git+https://github.com/osmocom/sphinx-argparse@inside-classes#egg=sphinx-argparse' \t\t'git+https://github.com/podshumok/python-smpplib.git' \t\t'pydbus' \t\t'pysispm' \t\t'ruff' \t\t'sphinx' \t\t'sphinxcontrib-napoleon' \t\t-r /tmp/pysim_requirements.txt" did not complete successfully: exit code: 1
------
 > [ 8/16] RUN	SET -x && 	cat /tmp/pysim_requirements.txt && 	pip3 install --break-system-packages 		'git+https://github.com/eriwen/lcov-to-cobertura-xml.git' 		'git+https://github.com/osmocom/sphinx-argparse@inside-classes#egg=sphinx-argparse' 		'git+https://github.com/podshumok/python-smpplib.git' 		'pydbus' 		'pysispm' 		'ruff' 		'sphinx' 		'sphinxcontrib-napoleon' 		-r /tmp/pysim_requirements.txt:
3.210       [end of output]
3.210   
3.210   note: This error originates from a subprocess, and is likely not a problem with pip.
3.211 error: subprocess-exited-with-error
3.211 
3.211 × Getting requirements to build wheel did not run successfully.
3.211 │ exit code: 1
3.211 ╰─> See above for output.
3.211 
3.211 note: This error originates from a subprocess, and is likely not a problem with pip.
------
Dockerfile:177
--------------------
 176 |     ADD	https://gitea.osmocom.org/sim-card/pysim/raw/branch/master/requirements.txt /tmp/pysim_requirements.txt
 177 | >>> RUN	set -x && \
 178 | >>> 	cat /tmp/pysim_requirements.txt && \
 179 | >>> 	pip3 install --break-system-packages \
 180 | >>> 		'git+https://github.com/eriwen/lcov-to-cobertura-xml.git' \
 181 | >>> 		'git+https://github.com/osmocom/sphinx-argparse@inside-classes#egg=sphinx-argparse' \
 182 | >>> 		'git+https://github.com/podshumok/python-smpplib.git' \
 183 | >>> 		'pydbus' \
 184 | >>> 		'pysispm' \
 185 | >>> 		'ruff' \
 186 | >>> 		'sphinx' \
 187 | >>> 		'sphinxcontrib-napoleon' \
 188 | >>> 		-r /tmp/pysim_requirements.txt
 189 |     
--------------------
ERROR: failed to solve: process "/bin/sh -c set -x && \tcat /tmp/pysim_requirements.txt && \tpip3 install --break-system-packages \t\t'git+https://github.com/eriwen/lcov-to-cobertura-xml.git' \t\t'git+https://github.com/osmocom/sphinx-argparse@inside-classes#egg=sphinx-argparse' \t\t'git+https://github.com/podshumok/python-smpplib.git' \t\t'pydbus' \t\t'pysispm' \t\t'ruff' \t\t'sphinx' \t\t'sphinxcontrib-napoleon' \t\t-r /tmp/pysim_requirements.txt" did not complete successfully: exit code: 1
make: *** [../make/Makefile:95: docker-build] Error 1
make: Leaving directory '/home/osmocom-build/jenkins/workspace/nplab-m3ua-test/debian-bookworm-build'
+ exit 1
Build step 'Execute shell' marked build as failure
Recording test results
ERROR: Step ‘Publish JUnit test result report’ failed: No test report files were found. Configuration error?
Sending e-mails to: jenkins-notifications@lists.osmocom.org
Archiving artifacts
Finished: FAILURE