Skipping 408 KB..
Full Log#15 111.7 Unpacking git (1:2.39.5-0+deb12u2) ...
#15 112.1 Selecting previously unselected package libann0.
#15 112.1 Preparing to unpack .../332-libann0_1.1.2+doc-9+b1_amd64.deb ...
#15 112.1 Unpacking libann0 (1.1.2+doc-9+b1) ...
#15 112.2 Selecting previously unselected package libcdt5:amd64.
#15 112.2 Preparing to unpack .../333-libcdt5_2.42.2-7+deb12u1_amd64.deb ...
#15 112.3 Unpacking libcdt5:amd64 (2.42.2-7+deb12u1) ...
#15 112.4 Selecting previously unselected package libcgraph6:amd64.
#15 112.4 Preparing to unpack .../334-libcgraph6_2.42.2-7+deb12u1_amd64.deb ...
#15 112.4 Unpacking libcgraph6:amd64 (2.42.2-7+deb12u1) ...
#15 112.6 Selecting previously unselected package libaom3:amd64.
#15 112.6 Preparing to unpack .../335-libaom3_3.6.0-1+deb12u1_amd64.deb ...
#15 112.6 Unpacking libaom3:amd64 (3.6.0-1+deb12u1) ...
#15 112.8 Selecting previously unselected package libdav1d6:amd64.
#15 112.8 Preparing to unpack .../336-libdav1d6_1.0.0-2+deb12u1_amd64.deb ...
#15 112.9 Unpacking libdav1d6:amd64 (1.0.0-2+deb12u1) ...
#15 113.0 Selecting previously unselected package libabsl20220623:amd64.
#15 113.0 Preparing to unpack .../337-libabsl20220623_20220623.1-1_amd64.deb ...
#15 113.0 Unpacking libabsl20220623:amd64 (20220623.1-1) ...
#15 113.2 Selecting previously unselected package libgav1-1:amd64.
#15 113.2 Preparing to unpack .../338-libgav1-1_0.18.0-1+b1_amd64.deb ...
#15 113.2 Unpacking libgav1-1:amd64 (0.18.0-1+b1) ...
#15 113.4 Selecting previously unselected package librav1e0:amd64.
#15 113.4 Preparing to unpack .../339-librav1e0_0.5.1-6_amd64.deb ...
#15 113.4 Unpacking librav1e0:amd64 (0.5.1-6) ...
#15 113.6 Selecting previously unselected package libsvtav1enc1:amd64.
#15 113.6 Preparing to unpack .../340-libsvtav1enc1_1.4.1+dfsg-1_amd64.deb ...
#15 113.6 Unpacking libsvtav1enc1:amd64 (1.4.1+dfsg-1) ...
#15 113.8 Selecting previously unselected package libyuv0:amd64.
#15 113.8 Preparing to unpack .../341-libyuv0_0.0~git20230123.b2528b0-1_amd64.deb ...
#15 113.9 Unpacking libyuv0:amd64 (0.0~git20230123.b2528b0-1) ...
#15 114.0 Selecting previously unselected package libavif15:amd64.
#15 114.0 Preparing to unpack .../342-libavif15_0.11.1-1_amd64.deb ...
#15 114.0 Unpacking libavif15:amd64 (0.11.1-1) ...
#15 114.2 Selecting previously unselected package libde265-0:amd64.
#15 114.2 Preparing to unpack .../343-libde265-0_1.0.11-1+deb12u2_amd64.deb ...
#15 114.2 Unpacking libde265-0:amd64 (1.0.11-1+deb12u2) ...
#15 114.4 Selecting previously unselected package libnuma1:amd64.
#15 114.4 Preparing to unpack .../344-libnuma1_2.0.16-1_amd64.deb ...
#15 114.4 Unpacking libnuma1:amd64 (2.0.16-1) ...
#15 114.5 Selecting previously unselected package libx265-199:amd64.
#15 114.5 Preparing to unpack .../345-libx265-199_3.5-2+b1_amd64.deb ...
#15 114.5 Unpacking libx265-199:amd64 (3.5-2+b1) ...
#15 114.7 Selecting previously unselected package libheif1:amd64.
#15 114.8 Preparing to unpack .../346-libheif1_1.15.1-1+deb12u1_amd64.deb ...
#15 114.8 Unpacking libheif1:amd64 (1.15.1-1+deb12u1) ...
#15 114.9 Selecting previously unselected package libgd3:amd64.
#15 114.9 Preparing to unpack .../347-libgd3_2.3.3-9_amd64.deb ...
#15 115.0 Unpacking libgd3:amd64 (2.3.3-9) ...
#15 115.1 Selecting previously unselected package libgts-0.7-5:amd64.
#15 115.1 Preparing to unpack .../348-libgts-0.7-5_0.7.6+darcs121130-5+b1_amd64.deb ...
#15 115.1 Unpacking libgts-0.7-5:amd64 (0.7.6+darcs121130-5+b1) ...
#15 115.3 Selecting previously unselected package libltdl7:amd64.
#15 115.3 Preparing to unpack .../349-libltdl7_2.4.7-7~deb12u1_amd64.deb ...
#15 115.3 Unpacking libltdl7:amd64 (2.4.7-7~deb12u1) ...
#15 115.5 Selecting previously unselected package libfribidi0:amd64.
#15 115.5 Preparing to unpack .../350-libfribidi0_1.0.8-2.1_amd64.deb ...
#15 115.5 Unpacking libfribidi0:amd64 (1.0.8-2.1) ...
#15 115.7 Selecting previously unselected package libpango-1.0-0:amd64.
#15 115.7 Preparing to unpack .../351-libpango-1.0-0_1.50.12+ds-1_amd64.deb ...
#15 115.7 Unpacking libpango-1.0-0:amd64 (1.50.12+ds-1) ...
#15 115.9 Selecting previously unselected package libpangoft2-1.0-0:amd64.
#15 115.9 Preparing to unpack .../352-libpangoft2-1.0-0_1.50.12+ds-1_amd64.deb ...
#15 115.9 Unpacking libpangoft2-1.0-0:amd64 (1.50.12+ds-1) ...
#15 116.0 Selecting previously unselected package libpangocairo-1.0-0:amd64.
#15 116.0 Preparing to unpack .../353-libpangocairo-1.0-0_1.50.12+ds-1_amd64.deb ...
#15 116.1 Unpacking libpangocairo-1.0-0:amd64 (1.50.12+ds-1) ...
#15 116.2 Selecting previously unselected package libpathplan4:amd64.
#15 116.2 Preparing to unpack .../354-libpathplan4_2.42.2-7+deb12u1_amd64.deb ...
#15 116.2 Unpacking libpathplan4:amd64 (2.42.2-7+deb12u1) ...
#15 116.4 Selecting previously unselected package libgvc6.
#15 116.4 Preparing to unpack .../355-libgvc6_2.42.2-7+deb12u1_amd64.deb ...
#15 116.4 Unpacking libgvc6 (2.42.2-7+deb12u1) ...
#15 116.6 Selecting previously unselected package libgvpr2:amd64.
#15 116.6 Preparing to unpack .../356-libgvpr2_2.42.2-7+deb12u1_amd64.deb ...
#15 116.6 Unpacking libgvpr2:amd64 (2.42.2-7+deb12u1) ...
#15 116.8 Selecting previously unselected package liblab-gamut1:amd64.
#15 116.8 Preparing to unpack .../357-liblab-gamut1_2.42.2-7+deb12u1_amd64.deb ...
#15 116.8 Unpacking liblab-gamut1:amd64 (2.42.2-7+deb12u1) ...
#15 117.0 Selecting previously unselected package graphviz.
#15 117.0 Preparing to unpack .../358-graphviz_2.42.2-7+deb12u1_amd64.deb ...
#15 117.0 Unpacking graphviz (2.42.2-7+deb12u1) ...
#15 117.2 Selecting previously unselected package libnl-3-200:amd64.
#15 117.2 Preparing to unpack .../359-libnl-3-200_3.7.0-0.2+b1_amd64.deb ...
#15 117.2 Unpacking libnl-3-200:amd64 (3.7.0-0.2+b1) ...
#15 117.3 Selecting previously unselected package libnl-genl-3-200:amd64.
#15 117.4 Preparing to unpack .../360-libnl-genl-3-200_3.7.0-0.2+b1_amd64.deb ...
#15 117.4 Unpacking libnl-genl-3-200:amd64 (3.7.0-0.2+b1) ...
#15 117.5 Selecting previously unselected package htop.
#15 117.5 Preparing to unpack .../361-htop_3.2.2-2_amd64.deb ...
#15 117.5 Unpacking htop (3.2.2-2) ...
#15 117.7 Selecting previously unselected package libnl-route-3-200:amd64.
#15 117.7 Preparing to unpack .../362-libnl-route-3-200_3.7.0-0.2+b1_amd64.deb ...
#15 117.7 Unpacking libnl-route-3-200:amd64 (3.7.0-0.2+b1) ...
#15 117.9 Selecting previously unselected package libibverbs1:amd64.
#15 117.9 Preparing to unpack .../363-libibverbs1_44.0-2_amd64.deb ...
#15 117.9 Unpacking libibverbs1:amd64 (44.0-2) ...
#15 118.1 Selecting previously unselected package ibverbs-providers:amd64.
#15 118.1 Preparing to unpack .../364-ibverbs-providers_44.0-2_amd64.deb ...
#15 118.2 Unpacking ibverbs-providers:amd64 (44.0-2) ...
#15 118.3 Selecting previously unselected package icu-devtools.
#15 118.3 Preparing to unpack .../365-icu-devtools_72.1-3_amd64.deb ...
#15 118.3 Unpacking icu-devtools (72.1-3) ...
#15 118.5 Selecting previously unselected package libgssrpc4:amd64.
#15 118.5 Preparing to unpack .../366-libgssrpc4_1.20.1-2+deb12u2_amd64.deb ...
#15 118.6 Unpacking libgssrpc4:amd64 (1.20.1-2+deb12u2) ...
#15 118.7 Selecting previously unselected package libkdb5-10:amd64.
#15 118.7 Preparing to unpack .../367-libkdb5-10_1.20.1-2+deb12u2_amd64.deb ...
#15 118.7 Unpacking libkdb5-10:amd64 (1.20.1-2+deb12u2) ...
#15 118.9 Selecting previously unselected package libkadm5srv-mit12:amd64.
#15 118.9 Preparing to unpack .../368-libkadm5srv-mit12_1.20.1-2+deb12u2_amd64.deb ...
#15 118.9 Unpacking libkadm5srv-mit12:amd64 (1.20.1-2+deb12u2) ...
#15 119.0 Selecting previously unselected package libkadm5clnt-mit12:amd64.
#15 119.1 Preparing to unpack .../369-libkadm5clnt-mit12_1.20.1-2+deb12u2_amd64.deb ...
#15 119.1 Unpacking libkadm5clnt-mit12:amd64 (1.20.1-2+deb12u2) ...
#15 119.2 Selecting previously unselected package krb5-multidev:amd64.
#15 119.2 Preparing to unpack .../370-krb5-multidev_1.20.1-2+deb12u2_amd64.deb ...
#15 119.2 Unpacking krb5-multidev:amd64 (1.20.1-2+deb12u2) ...
#15 119.4 Selecting previously unselected package latexmk.
#15 119.4 Preparing to unpack .../371-latexmk_1%3a4.79-1_all.deb ...
#15 119.4 Unpacking latexmk (1:4.79-1) ...
#15 119.5 Selecting previously unselected package libjson-perl.
#15 119.5 Preparing to unpack .../372-libjson-perl_4.10000-1_all.deb ...
#15 119.6 Unpacking libjson-perl (4.10000-1) ...
#15 119.7 Selecting previously unselected package libperlio-gzip-perl.
#15 119.7 Preparing to unpack .../373-libperlio-gzip-perl_0.20-1+b1_amd64.deb ...
#15 119.7 Unpacking libperlio-gzip-perl (0.20-1+b1) ...
#15 119.8 Selecting previously unselected package lcov.
#15 119.9 Preparing to unpack .../374-lcov_1.16-1_all.deb ...
#15 119.9 Unpacking lcov (1.16-1) ...
#15 120.0 Selecting previously unselected package libaio1:amd64.
#15 120.0 Preparing to unpack .../375-libaio1_0.3.113-4_amd64.deb ...
#15 120.1 Unpacking libaio1:amd64 (0.3.113-4) ...
#15 120.2 Selecting previously unselected package libaio-dev:amd64.
#15 120.2 Preparing to unpack .../376-libaio-dev_0.3.113-4_amd64.deb ...
#15 120.2 Unpacking libaio-dev:amd64 (0.3.113-4) ...
#15 120.3 Selecting previously unselected package libasound2-data.
#15 120.3 Preparing to unpack .../377-libasound2-data_1.2.8-1_all.deb ...
#15 120.4 Unpacking libasound2-data (1.2.8-1) ...
#15 120.5 Selecting previously unselected package libasound2:amd64.
#15 120.5 Preparing to unpack .../378-libasound2_1.2.8-1+b1_amd64.deb ...
#15 120.5 Unpacking libasound2:amd64 (1.2.8-1+b1) ...
#15 120.7 Selecting previously unselected package libasound2-dev:amd64.
#15 120.7 Preparing to unpack .../379-libasound2-dev_1.2.8-1+b1_amd64.deb ...
#15 120.7 Unpacking libasound2-dev:amd64 (1.2.8-1+b1) ...
#15 120.9 Selecting previously unselected package libdecaf0:amd64.
#15 120.9 Preparing to unpack .../380-libdecaf0_1.0.2-2_amd64.deb ...
#15 120.9 Unpacking libdecaf0:amd64 (1.0.2-2) ...
#15 121.0 Selecting previously unselected package libmbedcrypto7:amd64.
#15 121.1 Preparing to unpack .../381-libmbedcrypto7_2.28.3-1_amd64.deb ...
#15 121.1 Unpacking libmbedcrypto7:amd64 (2.28.3-1) ...
#15 121.2 Selecting previously unselected package libmbedx509-1:amd64.
#15 121.2 Preparing to unpack .../382-libmbedx509-1_2.28.3-1_amd64.deb ...
#15 121.3 Unpacking libmbedx509-1:amd64 (2.28.3-1) ...
#15 121.4 Selecting previously unselected package libmbedtls14:amd64.
#15 121.4 Preparing to unpack .../383-libmbedtls14_2.28.3-1_amd64.deb ...
#15 121.4 Unpacking libmbedtls14:amd64 (2.28.3-1) ...
#15 121.6 Selecting previously unselected package libbctoolbox1:amd64.
#15 121.6 Preparing to unpack .../384-libbctoolbox1_5.1.64-2_amd64.deb ...
#15 121.6 Unpacking libbctoolbox1:amd64 (5.1.64-2) ...
#15 121.8 Selecting previously unselected package libbctoolbox-dev:amd64.
#15 121.8 Preparing to unpack .../385-libbctoolbox-dev_5.1.64-2_amd64.deb ...
#15 121.8 Unpacking libbctoolbox-dev:amd64 (5.1.64-2) ...
#15 121.9 Selecting previously unselected package libusb-1.0-0:amd64.
#15 122.0 Preparing to unpack .../386-libusb-1.0-0_2%3a1.0.26-1_amd64.deb ...
#15 122.0 Unpacking libusb-1.0-0:amd64 (2:1.0.26-1) ...
#15 122.1 Selecting previously unselected package libbladerf2:amd64.
#15 122.1 Preparing to unpack .../387-libbladerf2_0.2022.11-1_amd64.deb ...
#15 122.1 Unpacking libbladerf2:amd64 (0.2022.11-1) ...
#15 122.3 Selecting previously unselected package libbladerf-dev:amd64.
#15 122.3 Preparing to unpack .../388-libbladerf-dev_0.2022.11-1_amd64.deb ...
#15 122.3 Unpacking libbladerf-dev:amd64 (0.2022.11-1) ...
#15 122.4 Selecting previously unselected package uuid-dev:amd64.
#15 122.4 Preparing to unpack .../389-uuid-dev_2.38.1-5+deb12u3_amd64.deb ...
#15 122.5 Unpacking uuid-dev:amd64 (2.38.1-5+deb12u3) ...
#15 122.6 Selecting previously unselected package libblkid-dev:amd64.
#15 122.6 Preparing to unpack .../390-libblkid-dev_2.38.1-5+deb12u3_amd64.deb ...
#15 122.6 Unpacking libblkid-dev:amd64 (2.38.1-5+deb12u3) ...
#15 122.8 Selecting previously unselected package libboost1.74-dev:amd64.
#15 122.8 Preparing to unpack .../391-libboost1.74-dev_1.74.0+ds1-21_amd64.deb ...
#15 122.8 Unpacking libboost1.74-dev:amd64 (1.74.0+ds1-21) ...
#15 123.8 Selecting previously unselected package libboost-dev:amd64.
#15 123.8 Preparing to unpack .../392-libboost-dev_1.74.0.3_amd64.deb ...
#15 123.8 Unpacking libboost-dev:amd64 (1.74.0.3) ...
#15 124.0 Selecting previously unselected package libboost1.74-tools-dev.
#15 124.0 Preparing to unpack .../393-libboost1.74-tools-dev_1.74.0+ds1-21_amd64.deb ...
#15 124.0 Unpacking libboost1.74-tools-dev (1.74.0+ds1-21) ...
#15 124.2 Selecting previously unselected package libboost-tools-dev.
#15 124.2 Preparing to unpack .../394-libboost-tools-dev_1.74.0.3_amd64.deb ...
#15 124.2 Unpacking libboost-tools-dev (1.74.0.3) ...
#15 124.4 Selecting previously unselected package libboost-atomic1.74.0:amd64.
#15 124.4 Preparing to unpack .../395-libboost-atomic1.74.0_1.74.0+ds1-21_amd64.deb ...
#15 124.4 Unpacking libboost-atomic1.74.0:amd64 (1.74.0+ds1-21) ...
#15 124.5 Selecting previously unselected package libboost-atomic1.74-dev:amd64.
#15 124.5 Preparing to unpack .../396-libboost-atomic1.74-dev_1.74.0+ds1-21_amd64.deb ...
#15 124.6 Unpacking libboost-atomic1.74-dev:amd64 (1.74.0+ds1-21) ...
#15 124.7 Selecting previously unselected package libboost-atomic-dev:amd64.
#15 124.7 Preparing to unpack .../397-libboost-atomic-dev_1.74.0.3_amd64.deb ...
#15 124.7 Unpacking libboost-atomic-dev:amd64 (1.74.0.3) ...
#15 124.9 Selecting previously unselected package libboost-chrono1.74.0:amd64.
#15 124.9 Preparing to unpack .../398-libboost-chrono1.74.0_1.74.0+ds1-21_amd64.deb ...
#15 124.9 Unpacking libboost-chrono1.74.0:amd64 (1.74.0+ds1-21) ...
#15 125.0 Selecting previously unselected package libboost-chrono1.74-dev:amd64.
#15 125.0 Preparing to unpack .../399-libboost-chrono1.74-dev_1.74.0+ds1-21_amd64.deb ...
#15 125.0 Unpacking libboost-chrono1.74-dev:amd64 (1.74.0+ds1-21) ...
#15 125.2 Selecting previously unselected package libboost-chrono-dev:amd64.
#15 125.2 Preparing to unpack .../400-libboost-chrono-dev_1.74.0.3_amd64.deb ...
#15 125.2 Unpacking libboost-chrono-dev:amd64 (1.74.0.3) ...
#15 125.4 Selecting previously unselected package libboost-container1.74.0:amd64.
#15 125.4 Preparing to unpack .../401-libboost-container1.74.0_1.74.0+ds1-21_amd64.deb ...
#15 125.4 Unpacking libboost-container1.74.0:amd64 (1.74.0+ds1-21) ...
#15 125.5 Selecting previously unselected package libboost-container1.74-dev:amd64.
#15 125.5 Preparing to unpack .../402-libboost-container1.74-dev_1.74.0+ds1-21_amd64.deb ...
#15 125.5 Unpacking libboost-container1.74-dev:amd64 (1.74.0+ds1-21) ...
#15 125.7 Selecting previously unselected package libboost-container-dev:amd64.
#15 125.7 Preparing to unpack .../403-libboost-container-dev_1.74.0.3_amd64.deb ...
#15 125.7 Unpacking libboost-container-dev:amd64 (1.74.0.3) ...
#15 125.9 Selecting previously unselected package libboost-date-time1.74.0:amd64.
#15 125.9 Preparing to unpack .../404-libboost-date-time1.74.0_1.74.0+ds1-21_amd64.deb ...
#15 125.9 Unpacking libboost-date-time1.74.0:amd64 (1.74.0+ds1-21) ...
#15 126.0 Selecting previously unselected package libboost-serialization1.74.0:amd64.
#15 126.1 Preparing to unpack .../405-libboost-serialization1.74.0_1.74.0+ds1-21_amd64.deb ...
#15 126.1 Unpacking libboost-serialization1.74.0:amd64 (1.74.0+ds1-21) ...
#15 126.2 Selecting previously unselected package libboost-serialization1.74-dev:amd64.
#15 126.2 Preparing to unpack .../406-libboost-serialization1.74-dev_1.74.0+ds1-21_amd64.deb ...
#15 126.3 Unpacking libboost-serialization1.74-dev:amd64 (1.74.0+ds1-21) ...
#15 126.5 Selecting previously unselected package libboost-date-time1.74-dev:amd64.
#15 126.5 Preparing to unpack .../407-libboost-date-time1.74-dev_1.74.0+ds1-21_amd64.deb ...
#15 126.5 Unpacking libboost-date-time1.74-dev:amd64 (1.74.0+ds1-21) ...
#15 126.7 Selecting previously unselected package libboost-system1.74.0:amd64.
#15 126.7 Preparing to unpack .../408-libboost-system1.74.0_1.74.0+ds1-21_amd64.deb ...
#15 126.7 Unpacking libboost-system1.74.0:amd64 (1.74.0+ds1-21) ...
#15 126.8 Selecting previously unselected package libboost-system1.74-dev:amd64.
#15 126.9 Preparing to unpack .../409-libboost-system1.74-dev_1.74.0+ds1-21_amd64.deb ...
#15 126.9 Unpacking libboost-system1.74-dev:amd64 (1.74.0+ds1-21) ...
#15 127.0 Selecting previously unselected package libboost-thread1.74.0:amd64.
#15 127.0 Preparing to unpack .../410-libboost-thread1.74.0_1.74.0+ds1-21_amd64.deb ...
#15 127.1 Unpacking libboost-thread1.74.0:amd64 (1.74.0+ds1-21) ...
#15 127.2 Selecting previously unselected package libboost-thread1.74-dev:amd64.
#15 127.2 Preparing to unpack .../411-libboost-thread1.74-dev_1.74.0+ds1-21_amd64.deb ...
#15 127.2 Unpacking libboost-thread1.74-dev:amd64 (1.74.0+ds1-21) ...
#15 127.4 Selecting previously unselected package libboost-context1.74.0:amd64.
#15 127.4 Preparing to unpack .../412-libboost-context1.74.0_1.74.0+ds1-21_amd64.deb ...
#15 127.4 Unpacking libboost-context1.74.0:amd64 (1.74.0+ds1-21) ...
#15 127.5 Selecting previously unselected package libboost-context1.74-dev:amd64.
#15 127.6 Preparing to unpack .../413-libboost-context1.74-dev_1.74.0+ds1-21_amd64.deb ...
#15 127.6 Unpacking libboost-context1.74-dev:amd64 (1.74.0+ds1-21) ...
#15 127.7 Selecting previously unselected package libboost-context-dev:amd64.
#15 127.7 Preparing to unpack .../414-libboost-context-dev_1.74.0.3_amd64.deb ...
#15 127.7 Unpacking libboost-context-dev:amd64 (1.74.0.3) ...
#15 127.9 Selecting previously unselected package libboost-coroutine1.74.0:amd64.
#15 127.9 Preparing to unpack .../415-libboost-coroutine1.74.0_1.74.0+ds1-21_amd64.deb ...
#15 127.9 Unpacking libboost-coroutine1.74.0:amd64 (1.74.0+ds1-21) ...
#15 128.0 Selecting previously unselected package libboost-coroutine1.74-dev:amd64.
#15 128.1 Preparing to unpack .../416-libboost-coroutine1.74-dev_1.74.0+ds1-21_amd64.deb ...
#15 128.1 Unpacking libboost-coroutine1.74-dev:amd64 (1.74.0+ds1-21) ...
#15 128.2 Selecting previously unselected package libboost-coroutine-dev:amd64.
#15 128.2 Preparing to unpack .../417-libboost-coroutine-dev_1.74.0.3_amd64.deb ...
#15 128.2 Unpacking libboost-coroutine-dev:amd64 (1.74.0.3) ...
#15 128.4 Selecting previously unselected package libboost-date-time-dev:amd64.
#15 128.4 Preparing to unpack .../418-libboost-date-time-dev_1.74.0.3_amd64.deb ...
#15 128.4 Unpacking libboost-date-time-dev:amd64 (1.74.0.3) ...
#15 128.5 Selecting previously unselected package libboost-exception1.74-dev:amd64.
#15 128.6 Preparing to unpack .../419-libboost-exception1.74-dev_1.74.0+ds1-21_amd64.deb ...
#15 128.6 Unpacking libboost-exception1.74-dev:amd64 (1.74.0+ds1-21) ...
#15 128.7 Selecting previously unselected package libboost-exception-dev:amd64.
#15 128.7 Preparing to unpack .../420-libboost-exception-dev_1.74.0.3_amd64.deb ...
#15 128.7 Unpacking libboost-exception-dev:amd64 (1.74.0.3) ...
#15 128.9 Selecting previously unselected package libboost-filesystem1.74.0:amd64.
#15 128.9 Preparing to unpack .../421-libboost-filesystem1.74.0_1.74.0+ds1-21_amd64.deb ...
#15 128.9 Unpacking libboost-filesystem1.74.0:amd64 (1.74.0+ds1-21) ...
#15 129.1 Selecting previously unselected package libboost-filesystem1.74-dev:amd64.
#15 129.1 Preparing to unpack .../422-libboost-filesystem1.74-dev_1.74.0+ds1-21_amd64.deb ...
#15 129.1 Unpacking libboost-filesystem1.74-dev:amd64 (1.74.0+ds1-21) ...
#15 129.3 Selecting previously unselected package libboost-fiber1.74.0:amd64.
#15 129.3 Preparing to unpack .../423-libboost-fiber1.74.0_1.74.0+ds1-21_amd64.deb ...
#15 129.3 Unpacking libboost-fiber1.74.0:amd64 (1.74.0+ds1-21) ...
#15 129.5 Selecting previously unselected package libboost-fiber1.74-dev:amd64.
#15 129.5 Preparing to unpack .../424-libboost-fiber1.74-dev_1.74.0+ds1-21_amd64.deb ...
#15 129.5 Unpacking libboost-fiber1.74-dev:amd64 (1.74.0+ds1-21) ...
#15 129.6 Selecting previously unselected package libboost-fiber-dev:amd64.
#15 129.6 Preparing to unpack .../425-libboost-fiber-dev_1.74.0.3_amd64.deb ...
#15 129.7 Unpacking libboost-fiber-dev:amd64 (1.74.0.3) ...
#15 129.8 Selecting previously unselected package libboost-filesystem-dev:amd64.
#15 129.8 Preparing to unpack .../426-libboost-filesystem-dev_1.74.0.3_amd64.deb ...
#15 129.8 Unpacking libboost-filesystem-dev:amd64 (1.74.0.3) ...
#15 129.9 Selecting previously unselected package libboost-regex1.74.0:amd64.
#15 129.9 Preparing to unpack .../427-libboost-regex1.74.0_1.74.0+ds1-21_amd64.deb ...
#15 130.0 Unpacking libboost-regex1.74.0:amd64 (1.74.0+ds1-21) ...
#15 130.1 Selecting previously unselected package libboost-graph1.74.0:amd64.
#15 130.1 Preparing to unpack .../428-libboost-graph1.74.0_1.74.0+ds1-21_amd64.deb ...
#15 130.2 Unpacking libboost-graph1.74.0:amd64 (1.74.0+ds1-21) ...
#15 130.3 Selecting previously unselected package libicu-dev:amd64.
#15 130.3 Preparing to unpack .../429-libicu-dev_72.1-3_amd64.deb ...
#15 130.3 Unpacking libicu-dev:amd64 (72.1-3) ...
#15 130.8 Selecting previously unselected package libboost-regex1.74-dev:amd64.
#15 130.8 Preparing to unpack .../430-libboost-regex1.74-dev_1.74.0+ds1-21_amd64.deb ...
#15 130.8 Unpacking libboost-regex1.74-dev:amd64 (1.74.0+ds1-21) ...
#15 131.0 Selecting previously unselected package libboost-test1.74.0:amd64.
#15 131.0 Preparing to unpack .../431-libboost-test1.74.0_1.74.0+ds1-21_amd64.deb ...
#15 131.0 Unpacking libboost-test1.74.0:amd64 (1.74.0+ds1-21) ...
#15 131.1 Selecting previously unselected package libboost-test1.74-dev:amd64.
#15 131.1 Preparing to unpack .../432-libboost-test1.74-dev_1.74.0+ds1-21_amd64.deb ...
#15 131.2 Unpacking libboost-test1.74-dev:amd64 (1.74.0+ds1-21) ...
#15 131.3 Selecting previously unselected package libboost-graph1.74-dev:amd64.
#15 131.3 Preparing to unpack .../433-libboost-graph1.74-dev_1.74.0+ds1-21_amd64.deb ...
#15 131.3 Unpacking libboost-graph1.74-dev:amd64 (1.74.0+ds1-21) ...
#15 131.5 Selecting previously unselected package libboost-graph-dev:amd64.
#15 131.5 Preparing to unpack .../434-libboost-graph-dev_1.74.0.3_amd64.deb ...
#15 131.6 Unpacking libboost-graph-dev:amd64 (1.74.0.3) ...
#15 131.7 Selecting previously unselected package libevent-core-2.1-7:amd64.
#15 131.7 Preparing to unpack .../435-libevent-core-2.1-7_2.1.12-stable-8_amd64.deb ...
#15 131.7 Unpacking libevent-core-2.1-7:amd64 (2.1.12-stable-8) ...
#15 131.9 Selecting previously unselected package libevent-pthreads-2.1-7:amd64.
#15 131.9 Preparing to unpack .../436-libevent-pthreads-2.1-7_2.1.12-stable-8_amd64.deb ...
#15 131.9 Unpacking libevent-pthreads-2.1-7:amd64 (2.1.12-stable-8) ...
#15 132.1 Selecting previously unselected package libpsm-infinipath1.
#15 132.1 Preparing to unpack .../437-libpsm-infinipath1_3.3+20.604758e7-6.2_amd64.deb ...
#15 132.1 Unpacking libpsm-infinipath1 (3.3+20.604758e7-6.2) ...
#15 132.3 Selecting previously unselected package libpsm2-2.
#15 132.3 Preparing to unpack .../438-libpsm2-2_11.2.185-2_amd64.deb ...
#15 132.3 Unpacking libpsm2-2 (11.2.185-2) ...
#15 132.5 Selecting previously unselected package librdmacm1:amd64.
#15 132.5 Preparing to unpack .../439-librdmacm1_44.0-2_amd64.deb ...
#15 132.5 Unpacking librdmacm1:amd64 (44.0-2) ...
#15 132.7 Selecting previously unselected package libfabric1:amd64.
#15 132.7 Preparing to unpack .../440-libfabric1_1.17.0-3_amd64.deb ...
#15 132.7 Unpacking libfabric1:amd64 (1.17.0-3) ...
#15 132.9 Selecting previously unselected package libhwloc15:amd64.
#15 132.9 Preparing to unpack .../441-libhwloc15_2.9.0-1_amd64.deb ...
#15 132.9 Unpacking libhwloc15:amd64 (2.9.0-1) ...
#15 133.1 Selecting previously unselected package libmunge2.
#15 133.1 Preparing to unpack .../442-libmunge2_0.5.15-2_amd64.deb ...
#15 133.1 Unpacking libmunge2 (0.5.15-2) ...
#15 133.3 Selecting previously unselected package libpciaccess0:amd64.
#15 133.3 Preparing to unpack .../443-libpciaccess0_0.17-2_amd64.deb ...
#15 133.3 Unpacking libpciaccess0:amd64 (0.17-2) ...
#15 133.5 Selecting previously unselected package libxnvctrl0:amd64.
#15 133.5 Preparing to unpack .../444-libxnvctrl0_525.85.05-3~deb12u1_amd64.deb ...
#15 133.5 Unpacking libxnvctrl0:amd64 (525.85.05-3~deb12u1) ...
#15 133.7 Selecting previously unselected package ocl-icd-libopencl1:amd64.
#15 133.7 Preparing to unpack .../445-ocl-icd-libopencl1_2.3.1-1_amd64.deb ...
#15 133.7 Unpacking ocl-icd-libopencl1:amd64 (2.3.1-1) ...
#15 133.8 Selecting previously unselected package libhwloc-plugins:amd64.
#15 133.8 Preparing to unpack .../446-libhwloc-plugins_2.9.0-1_amd64.deb ...
#15 133.9 Unpacking libhwloc-plugins:amd64 (2.9.0-1) ...
#15 134.0 Selecting previously unselected package libpmix2:amd64.
#15 134.0 Preparing to unpack .../447-libpmix2_4.2.2-1+deb12u1_amd64.deb ...
#15 134.0 Unpacking libpmix2:amd64 (4.2.2-1+deb12u1) ...
#15 134.2 Selecting previously unselected package libucx0:amd64.
#15 134.2 Preparing to unpack .../448-libucx0_1.13.1-1_amd64.deb ...
#15 134.2 Unpacking libucx0:amd64 (1.13.1-1) ...
#15 134.4 Selecting previously unselected package libopenmpi3:amd64.
#15 134.4 Preparing to unpack .../449-libopenmpi3_4.1.4-3+b1_amd64.deb ...
#15 134.5 Unpacking libopenmpi3:amd64 (4.1.4-3+b1) ...
#15 134.7 Selecting previously unselected package libboost-mpi1.74.0.
#15 134.7 Preparing to unpack .../450-libboost-mpi1.74.0_1.74.0+ds1-21_amd64.deb ...
#15 134.7 Unpacking libboost-mpi1.74.0 (1.74.0+ds1-21) ...
#15 134.9 Selecting previously unselected package libboost-graph-parallel1.74.0.
#15 134.9 Preparing to unpack .../451-libboost-graph-parallel1.74.0_1.74.0+ds1-21_amd64.deb ...
#15 134.9 Unpacking libboost-graph-parallel1.74.0 (1.74.0+ds1-21) ...
#15 135.1 Selecting previously unselected package libboost-graph-parallel1.74-dev.
#15 135.1 Preparing to unpack .../452-libboost-graph-parallel1.74-dev_1.74.0+ds1-21_amd64.deb ...
#15 135.1 Unpacking libboost-graph-parallel1.74-dev (1.74.0+ds1-21) ...
#15 135.2 Selecting previously unselected package libboost-graph-parallel-dev.
#15 135.2 Preparing to unpack .../453-libboost-graph-parallel-dev_1.74.0.3_amd64.deb ...
#15 135.3 Unpacking libboost-graph-parallel-dev (1.74.0.3) ...
#15 135.4 Selecting previously unselected package libboost-iostreams1.74.0:amd64.
#15 135.4 Preparing to unpack .../454-libboost-iostreams1.74.0_1.74.0+ds1-21_amd64.deb ...
#15 135.4 Unpacking libboost-iostreams1.74.0:amd64 (1.74.0+ds1-21) ...
#15 135.6 Selecting previously unselected package libboost-iostreams1.74-dev:amd64.
#15 135.6 Preparing to unpack .../455-libboost-iostreams1.74-dev_1.74.0+ds1-21_amd64.deb ...
#15 138.0 Unpacking libboost-iostreams1.74-dev:amd64 (1.74.0+ds1-21) ...
#15 138.2 Selecting previously unselected package libboost-iostreams-dev:amd64.
#15 138.2 Preparing to unpack .../456-libboost-iostreams-dev_1.74.0.3_amd64.deb ...
#15 138.2 Unpacking libboost-iostreams-dev:amd64 (1.74.0.3) ...
#15 138.4 Selecting previously unselected package libboost-locale1.74.0:amd64.
#15 138.4 Preparing to unpack .../457-libboost-locale1.74.0_1.74.0+ds1-21_amd64.deb ...
#15 138.4 Unpacking libboost-locale1.74.0:amd64 (1.74.0+ds1-21) ...
#15 138.6 Selecting previously unselected package libboost-locale1.74-dev:amd64.
#15 138.6 Preparing to unpack .../458-libboost-locale1.74-dev_1.74.0+ds1-21_amd64.deb ...
#15 138.6 Unpacking libboost-locale1.74-dev:amd64 (1.74.0+ds1-21) ...
#15 138.7 Selecting previously unselected package libboost-locale-dev:amd64.
#15 138.8 Preparing to unpack .../459-libboost-locale-dev_1.74.0.3_amd64.deb ...
#15 138.8 Unpacking libboost-locale-dev:amd64 (1.74.0.3) ...
#15 138.9 Selecting previously unselected package libboost-log1.74.0.
#15 138.9 Preparing to unpack .../460-libboost-log1.74.0_1.74.0+ds1-21_amd64.deb ...
#15 139.0 Unpacking libboost-log1.74.0 (1.74.0+ds1-21) ...
#15 139.1 Selecting previously unselected package libboost-log1.74-dev.
#15 139.1 Preparing to unpack .../461-libboost-log1.74-dev_1.74.0+ds1-21_amd64.deb ...
#15 139.1 Unpacking libboost-log1.74-dev (1.74.0+ds1-21) ...
#15 139.3 Selecting previously unselected package libboost-log-dev.
#15 139.3 Preparing to unpack .../462-libboost-log-dev_1.74.0.3_amd64.deb ...
#15 139.3 Unpacking libboost-log-dev (1.74.0.3) ...
#15 139.5 Selecting previously unselected package libboost-math1.74.0:amd64.
#15 139.5 Preparing to unpack .../463-libboost-math1.74.0_1.74.0+ds1-21_amd64.deb ...
#15 139.5 Unpacking libboost-math1.74.0:amd64 (1.74.0+ds1-21) ...
#15 139.6 Selecting previously unselected package libboost-math1.74-dev:amd64.
#15 139.7 Preparing to unpack .../464-libboost-math1.74-dev_1.74.0+ds1-21_amd64.deb ...
#15 139.7 Unpacking libboost-math1.74-dev:amd64 (1.74.0+ds1-21) ...
#15 139.9 Selecting previously unselected package libboost-math-dev:amd64.
#15 139.9 Preparing to unpack .../465-libboost-math-dev_1.74.0.3_amd64.deb ...
#15 139.9 Unpacking libboost-math-dev:amd64 (1.74.0.3) ...
#15 140.0 Selecting previously unselected package openmpi-common.
#15 140.0 Preparing to unpack .../466-openmpi-common_4.1.4-3_all.deb ...
#15 140.1 Unpacking openmpi-common (4.1.4-3) ...
#15 140.2 Selecting previously unselected package libnl-3-dev:amd64.
#15 140.2 Preparing to unpack .../467-libnl-3-dev_3.7.0-0.2+b1_amd64.deb ...
#15 140.2 Unpacking libnl-3-dev:amd64 (3.7.0-0.2+b1) ...
#15 140.4 Selecting previously unselected package libnl-route-3-dev:amd64.
#15 140.4 Preparing to unpack .../468-libnl-route-3-dev_3.7.0-0.2+b1_amd64.deb ...
#15 140.4 Unpacking libnl-route-3-dev:amd64 (3.7.0-0.2+b1) ...
#15 140.5 Selecting previously unselected package libibverbs-dev:amd64.
#15 140.5 Preparing to unpack .../469-libibverbs-dev_44.0-2_amd64.deb ...
#15 140.5 Unpacking libibverbs-dev:amd64 (44.0-2) ...
#15 140.7 Selecting previously unselected package libnuma-dev:amd64.
#15 140.7 Preparing to unpack .../470-libnuma-dev_2.0.16-1_amd64.deb ...
#15 140.7 Unpacking libnuma-dev:amd64 (2.0.16-1) ...
#15 140.9 Selecting previously unselected package libltdl-dev:amd64.
#15 140.9 Preparing to unpack .../471-libltdl-dev_2.4.7-7~deb12u1_amd64.deb ...
#15 140.9 Unpacking libltdl-dev:amd64 (2.4.7-7~deb12u1) ...
#15 141.0 Selecting previously unselected package libhwloc-dev:amd64.
#15 141.1 Preparing to unpack .../472-libhwloc-dev_2.9.0-1_amd64.deb ...
#15 141.1 Unpacking libhwloc-dev:amd64 (2.9.0-1) ...
#15 141.2 Selecting previously unselected package libevent-2.1-7:amd64.
#15 141.3 Preparing to unpack .../473-libevent-2.1-7_2.1.12-stable-8_amd64.deb ...
#15 141.3 Unpacking libevent-2.1-7:amd64 (2.1.12-stable-8) ...
#15 147.0 Selecting previously unselected package libevent-extra-2.1-7:amd64.
#15 147.0 Preparing to unpack .../474-libevent-extra-2.1-7_2.1.12-stable-8_amd64.deb ...
#15 147.0 Unpacking libevent-extra-2.1-7:amd64 (2.1.12-stable-8) ...
#15 147.2 Selecting previously unselected package libevent-openssl-2.1-7:amd64.
#15 147.2 Preparing to unpack .../475-libevent-openssl-2.1-7_2.1.12-stable-8_amd64.deb ...
#15 147.2 Unpacking libevent-openssl-2.1-7:amd64 (2.1.12-stable-8) ...
#15 147.4 Selecting previously unselected package libevent-dev.
#15 147.4 Preparing to unpack .../476-libevent-dev_2.1.12-stable-8_amd64.deb ...
#15 147.4 Unpacking libevent-dev (2.1.12-stable-8) ...
#15 147.5 Selecting previously unselected package zlib1g-dev:amd64.
#15 147.5 Preparing to unpack .../477-zlib1g-dev_1%3a1.2.13.dfsg-1_amd64.deb ...
#15 147.6 Unpacking zlib1g-dev:amd64 (1:1.2.13.dfsg-1) ...
#15 147.7 Selecting previously unselected package libpmix-dev:amd64.
#15 147.7 Preparing to unpack .../478-libpmix-dev_4.2.2-1+deb12u1_amd64.deb ...
#15 147.7 Unpacking libpmix-dev:amd64 (4.2.2-1+deb12u1) ...
#15 147.9 Selecting previously unselected package libjs-jquery-ui.
#15 147.9 Preparing to unpack .../479-libjs-jquery-ui_1.13.2+dfsg-1_all.deb ...
#15 147.9 Unpacking libjs-jquery-ui (1.13.2+dfsg-1) ...
#15 148.1 Selecting previously unselected package openmpi-bin.
#15 148.1 Preparing to unpack .../480-openmpi-bin_4.1.4-3+b1_amd64.deb ...
#15 148.1 Unpacking openmpi-bin (4.1.4-3+b1) ...
#15 148.3 Selecting previously unselected package libopenmpi-dev:amd64.
#15 148.3 Preparing to unpack .../481-libopenmpi-dev_4.1.4-3+b1_amd64.deb ...
#15 148.3 Unpacking libopenmpi-dev:amd64 (4.1.4-3+b1) ...
#15 148.5 Selecting previously unselected package mpi-default-dev.
#15 148.6 Preparing to unpack .../482-mpi-default-dev_1.14_amd64.deb ...
#15 148.6 Unpacking mpi-default-dev (1.14) ...
#15 148.7 Selecting previously unselected package libboost-mpi1.74-dev.
#15 148.7 Preparing to unpack .../483-libboost-mpi1.74-dev_1.74.0+ds1-21_amd64.deb ...
#15 148.7 Unpacking libboost-mpi1.74-dev (1.74.0+ds1-21) ...
#15 148.9 Selecting previously unselected package libboost-mpi-dev.
#15 148.9 Preparing to unpack .../484-libboost-mpi-dev_1.74.0.3_amd64.deb ...
#15 148.9 Unpacking libboost-mpi-dev (1.74.0.3) ...
#15 149.1 Selecting previously unselected package libboost-python1.74.0.
#15 149.1 Preparing to unpack .../485-libboost-python1.74.0_1.74.0+ds1-21_amd64.deb ...
#15 149.1 Unpacking libboost-python1.74.0 (1.74.0+ds1-21) ...
#15 149.3 Selecting previously unselected package mpi-default-bin.
#15 149.3 Preparing to unpack .../486-mpi-default-bin_1.14_amd64.deb ...
#15 149.3 Unpacking mpi-default-bin (1.14) ...
#15 149.5 Selecting previously unselected package libboost-mpi-python1.74.0.
#15 149.5 Preparing to unpack .../487-libboost-mpi-python1.74.0_1.74.0+ds1-21_amd64.deb ...
#15 149.5 Unpacking libboost-mpi-python1.74.0 (1.74.0+ds1-21) ...
#15 149.7 Selecting previously unselected package libboost-mpi-python1.74-dev.
#15 149.7 Preparing to unpack .../488-libboost-mpi-python1.74-dev_1.74.0+ds1-21_amd64.deb ...
#15 149.7 Unpacking libboost-mpi-python1.74-dev (1.74.0+ds1-21) ...
#15 149.8 Selecting previously unselected package libboost-mpi-python-dev.
#15 149.8 Preparing to unpack .../489-libboost-mpi-python-dev_1.74.0.3_amd64.deb ...
#15 149.9 Unpacking libboost-mpi-python-dev (1.74.0.3) ...
#15 150.0 Selecting previously unselected package libboost-numpy1.74.0.
#15 150.0 Preparing to unpack .../490-libboost-numpy1.74.0_1.74.0+ds1-21_amd64.deb ...
#15 150.0 Unpacking libboost-numpy1.74.0 (1.74.0+ds1-21) ...
#15 150.2 Selecting previously unselected package libboost-numpy1.74-dev.
#15 150.2 Preparing to unpack .../491-libboost-numpy1.74-dev_1.74.0+ds1-21_amd64.deb ...
#15 150.2 Unpacking libboost-numpy1.74-dev (1.74.0+ds1-21) ...
#15 150.4 Selecting previously unselected package libboost-numpy-dev.
#15 150.4 Preparing to unpack .../492-libboost-numpy-dev_1.74.0.3_amd64.deb ...
#15 150.4 Unpacking libboost-numpy-dev (1.74.0.3) ...
#15 150.5 Selecting previously unselected package libboost-program-options1.74.0:amd64.
#15 150.5 Preparing to unpack .../493-libboost-program-options1.74.0_1.74.0+ds1-21_amd64.deb ...
#15 150.6 Unpacking libboost-program-options1.74.0:amd64 (1.74.0+ds1-21) ...
#15 150.7 Selecting previously unselected package libboost-program-options1.74-dev:amd64.
#15 150.7 Preparing to unpack .../494-libboost-program-options1.74-dev_1.74.0+ds1-21_amd64.deb ...
#15 150.7 Unpacking libboost-program-options1.74-dev:amd64 (1.74.0+ds1-21) ...
#15 150.9 Selecting previously unselected package libboost-program-options-dev:amd64.
#15 150.9 Preparing to unpack .../495-libboost-program-options-dev_1.74.0.3_amd64.deb ...
#15 150.9 Unpacking libboost-program-options-dev:amd64 (1.74.0.3) ...
#15 151.1 Selecting previously unselected package libpython3.11:amd64.
#15 151.1 Preparing to unpack .../496-libpython3.11_3.11.2-6+deb12u5_amd64.deb ...
#15 151.1 Unpacking libpython3.11:amd64 (3.11.2-6+deb12u5) ...
#15 151.3 Selecting previously unselected package libexpat1-dev:amd64.
#15 151.3 Preparing to unpack .../497-libexpat1-dev_2.5.0-1+deb12u1_amd64.deb ...
#15 151.3 Unpacking libexpat1-dev:amd64 (2.5.0-1+deb12u1) ...
#15 151.6 Selecting previously unselected package libpython3.11-dev:amd64.
#15 151.6 Preparing to unpack .../498-libpython3.11-dev_3.11.2-6+deb12u5_amd64.deb ...
#15 151.7 Unpacking libpython3.11-dev:amd64 (3.11.2-6+deb12u5) ...
#15 152.0 Selecting previously unselected package libpython3-dev:amd64.
#15 152.0 Preparing to unpack .../499-libpython3-dev_3.11.2-1+b1_amd64.deb ...
#15 152.1 Unpacking libpython3-dev:amd64 (3.11.2-1+b1) ...
#15 152.2 Selecting previously unselected package python3.11-dev.
#15 152.2 Preparing to unpack .../500-python3.11-dev_3.11.2-6+deb12u5_amd64.deb ...
#15 152.2 Unpacking python3.11-dev (3.11.2-6+deb12u5) ...
#15 152.4 Selecting previously unselected package python3-lib2to3.
#15 152.4 Preparing to unpack .../501-python3-lib2to3_3.11.2-3_all.deb ...
#15 152.4 Unpacking python3-lib2to3 (3.11.2-3) ...
#15 152.6 Selecting previously unselected package python3-distutils.
#15 152.6 Preparing to unpack .../502-python3-distutils_3.11.2-3_all.deb ...
#15 152.6 Unpacking python3-distutils (3.11.2-3) ...
#15 152.7 Selecting previously unselected package libjs-underscore.
#15 152.8 Preparing to unpack .../503-libjs-underscore_1.13.4~dfsg+~1.11.4-3_all.deb ...
#15 152.8 Unpacking libjs-underscore (1.13.4~dfsg+~1.11.4-3) ...
#15 152.9 Selecting previously unselected package libjs-sphinxdoc.
#15 152.9 Preparing to unpack .../504-libjs-sphinxdoc_5.3.0-4_all.deb ...
#15 152.9 Unpacking libjs-sphinxdoc (5.3.0-4) ...
#15 153.1 Selecting previously unselected package python3-dev.
#15 153.1 Preparing to unpack .../505-python3-dev_3.11.2-1+b1_amd64.deb ...
#15 153.1 Unpacking python3-dev (3.11.2-1+b1) ...
#15 153.2 Selecting previously unselected package libboost-python1.74-dev.
#15 153.3 Preparing to unpack .../506-libboost-python1.74-dev_1.74.0+ds1-21_amd64.deb ...
#15 153.3 Unpacking libboost-python1.74-dev (1.74.0+ds1-21) ...
#15 153.4 Selecting previously unselected package libboost-python-dev.
#15 153.4 Preparing to unpack .../507-libboost-python-dev_1.74.0.3_amd64.deb ...
#15 153.4 Unpacking libboost-python-dev (1.74.0.3) ...
#15 153.6 Selecting previously unselected package libboost-random1.74.0:amd64.
#15 153.6 Preparing to unpack .../508-libboost-random1.74.0_1.74.0+ds1-21_amd64.deb ...
#15 153.6 Unpacking libboost-random1.74.0:amd64 (1.74.0+ds1-21) ...
#15 153.8 Selecting previously unselected package libboost-random1.74-dev:amd64.
#15 153.8 Preparing to unpack .../509-libboost-random1.74-dev_1.74.0+ds1-21_amd64.deb ...
#15 153.8 Unpacking libboost-random1.74-dev:amd64 (1.74.0+ds1-21) ...
#15 153.9 Selecting previously unselected package libboost-random-dev:amd64.
#15 153.9 Preparing to unpack .../510-libboost-random-dev_1.74.0.3_amd64.deb ...
#15 154.0 Unpacking libboost-random-dev:amd64 (1.74.0.3) ...
#15 154.1 Selecting previously unselected package libboost-regex-dev:amd64.
#15 154.1 Preparing to unpack .../511-libboost-regex-dev_1.74.0.3_amd64.deb ...
#15 154.1 Unpacking libboost-regex-dev:amd64 (1.74.0.3) ...
#15 154.2 Selecting previously unselected package libboost-serialization-dev:amd64.
#15 154.3 Preparing to unpack .../512-libboost-serialization-dev_1.74.0.3_amd64.deb ...
#15 154.3 Unpacking libboost-serialization-dev:amd64 (1.74.0.3) ...
#15 154.4 Selecting previously unselected package libboost-stacktrace1.74.0:amd64.
#15 154.4 Preparing to unpack .../513-libboost-stacktrace1.74.0_1.74.0+ds1-21_amd64.deb ...
#15 154.4 Unpacking libboost-stacktrace1.74.0:amd64 (1.74.0+ds1-21) ...
#15 154.6 Selecting previously unselected package libboost-stacktrace1.74-dev:amd64.
#15 154.6 Preparing to unpack .../514-libboost-stacktrace1.74-dev_1.74.0+ds1-21_amd64.deb ...
#15 154.6 Unpacking libboost-stacktrace1.74-dev:amd64 (1.74.0+ds1-21) ...
#15 154.7 Selecting previously unselected package libboost-stacktrace-dev:amd64.
#15 154.7 Preparing to unpack .../515-libboost-stacktrace-dev_1.74.0.3_amd64.deb ...
#15 154.8 Unpacking libboost-stacktrace-dev:amd64 (1.74.0.3) ...
#15 154.9 Selecting previously unselected package libboost-system-dev:amd64.
#15 154.9 Preparing to unpack .../516-libboost-system-dev_1.74.0.3_amd64.deb ...
#15 154.9 Unpacking libboost-system-dev:amd64 (1.74.0.3) ...
#15 155.0 Selecting previously unselected package libboost-test-dev:amd64.
#15 155.0 Preparing to unpack .../517-libboost-test-dev_1.74.0.3_amd64.deb ...
#15 155.1 Unpacking libboost-test-dev:amd64 (1.74.0.3) ...
#15 155.2 Selecting previously unselected package libboost-thread-dev:amd64.
#15 155.2 Preparing to unpack .../518-libboost-thread-dev_1.74.0.3_amd64.deb ...
#15 155.2 Unpacking libboost-thread-dev:amd64 (1.74.0.3) ...
#15 155.4 Selecting previously unselected package libboost-timer1.74.0:amd64.
#15 155.4 Preparing to unpack .../519-libboost-timer1.74.0_1.74.0+ds1-21_amd64.deb ...
#15 155.4 Unpacking libboost-timer1.74.0:amd64 (1.74.0+ds1-21) ...
#15 155.5 Selecting previously unselected package libboost-timer1.74-dev:amd64.
#15 155.6 Preparing to unpack .../520-libboost-timer1.74-dev_1.74.0+ds1-21_amd64.deb ...
#15 155.6 Unpacking libboost-timer1.74-dev:amd64 (1.74.0+ds1-21) ...
#15 155.7 Selecting previously unselected package libboost-timer-dev:amd64.
#15 155.7 Preparing to unpack .../521-libboost-timer-dev_1.74.0.3_amd64.deb ...
#15 155.7 Unpacking libboost-timer-dev:amd64 (1.74.0.3) ...
#15 155.9 Selecting previously unselected package libboost-type-erasure1.74.0:amd64.
#15 155.9 Preparing to unpack .../522-libboost-type-erasure1.74.0_1.74.0+ds1-21_amd64.deb ...
#15 155.9 Unpacking libboost-type-erasure1.74.0:amd64 (1.74.0+ds1-21) ...
#15 156.1 Selecting previously unselected package libboost-type-erasure1.74-dev:amd64.
#15 156.1 Preparing to unpack .../523-libboost-type-erasure1.74-dev_1.74.0+ds1-21_amd64.deb ...
#15 156.1 Unpacking libboost-type-erasure1.74-dev:amd64 (1.74.0+ds1-21) ...
#15 156.2 Selecting previously unselected package libboost-type-erasure-dev:amd64.
#15 156.3 Preparing to unpack .../524-libboost-type-erasure-dev_1.74.0.3_amd64.deb ...
#15 156.3 Unpacking libboost-type-erasure-dev:amd64 (1.74.0.3) ...
#15 156.4 Selecting previously unselected package libboost-wave1.74.0:amd64.
#15 156.4 Preparing to unpack .../525-libboost-wave1.74.0_1.74.0+ds1-21_amd64.deb ...
#15 156.4 Unpacking libboost-wave1.74.0:amd64 (1.74.0+ds1-21) ...
#15 156.6 Selecting previously unselected package libboost-wave1.74-dev:amd64.
#15 156.6 Preparing to unpack .../526-libboost-wave1.74-dev_1.74.0+ds1-21_amd64.deb ...
#15 156.6 Unpacking libboost-wave1.74-dev:amd64 (1.74.0+ds1-21) ...
#15 157.1 Selecting previously unselected package libboost-wave-dev:amd64.
#15 157.2 Preparing to unpack .../527-libboost-wave-dev_1.74.0.3_amd64.deb ...
#15 157.2 Unpacking libboost-wave-dev:amd64 (1.74.0.3) ...
#15 157.3 Selecting previously unselected package libboost-nowide1.74.0.
#15 157.3 Preparing to unpack .../528-libboost-nowide1.74.0_1.74.0+ds1-21_amd64.deb ...
#15 157.3 Unpacking libboost-nowide1.74.0 (1.74.0+ds1-21) ...
#15 157.5 Selecting previously unselected package libboost-nowide1.74-dev.
#15 157.5 Preparing to unpack .../529-libboost-nowide1.74-dev_1.74.0+ds1-21_amd64.deb ...
#15 157.5 Unpacking libboost-nowide1.74-dev (1.74.0+ds1-21) ...
#15 157.6 Selecting previously unselected package libboost-nowide-dev.
#15 157.6 Preparing to unpack .../530-libboost-nowide-dev_1.74.0.3_amd64.deb ...
#15 157.7 Unpacking libboost-nowide-dev (1.74.0.3) ...
#15 157.8 Selecting previously unselected package libboost-all-dev.
#15 157.8 Preparing to unpack .../531-libboost-all-dev_1.74.0.3_amd64.deb ...
#15 157.8 Unpacking libboost-all-dev (1.74.0.3) ...
#15 157.9 Selecting previously unselected package libmd-dev:amd64.
#15 157.9 Preparing to unpack .../532-libmd-dev_1.0.4-2_amd64.deb ...
#15 157.9 Unpacking libmd-dev:amd64 (1.0.4-2) ...
#15 158.1 Selecting previously unselected package libbsd-dev:amd64.
#15 158.1 Preparing to unpack .../533-libbsd-dev_0.11.7-2_amd64.deb ...
#15 158.1 Unpacking libbsd-dev:amd64 (0.11.7-2) ...
#15 158.3 Selecting previously unselected package libc-ares2:amd64.
#15 158.3 Preparing to unpack .../534-libc-ares2_1.18.1-3_amd64.deb ...
#15 158.4 Unpacking libc-ares2:amd64 (1.18.1-3) ...
#15 158.5 Selecting previously unselected package libc-ares-dev:amd64.
#15 158.5 Preparing to unpack .../535-libc-ares-dev_1.18.1-3_amd64.deb ...
#15 158.6 Unpacking libc-ares-dev:amd64 (1.18.1-3) ...
#15 158.7 Selecting previously unselected package libcairo-gobject2:amd64.
#15 158.7 Preparing to unpack .../536-libcairo-gobject2_1.16.0-7_amd64.deb ...
#15 158.7 Unpacking libcairo-gobject2:amd64 (1.16.0-7) ...
#15 158.9 Selecting previously unselected package libncurses6:amd64.
#15 158.9 Preparing to unpack .../537-libncurses6_6.4-4_amd64.deb ...
#15 158.9 Unpacking libncurses6:amd64 (6.4-4) ...
#15 159.1 Selecting previously unselected package libcdk5nc6:amd64.
#15 159.1 Preparing to unpack .../538-libcdk5nc6_5.0.20180306-3_amd64.deb ...
#15 159.1 Unpacking libcdk5nc6:amd64 (5.0.20180306-3) ...
#15 159.2 Selecting previously unselected package libncurses-dev:amd64.
#15 159.3 Preparing to unpack .../539-libncurses-dev_6.4-4_amd64.deb ...
#15 159.3 Unpacking libncurses-dev:amd64 (6.4-4) ...
#15 159.4 Selecting previously unselected package libcdk5-dev.
#15 159.4 Preparing to unpack .../540-libcdk5-dev_5.0.20180306-3_amd64.deb ...
#15 159.4 Unpacking libcdk5-dev (5.0.20180306-3) ...
#15 159.6 Selecting previously unselected package libcsv3:amd64.
#15 159.6 Preparing to unpack .../541-libcsv3_3.0.3+dfsg-6_amd64.deb ...
#15 159.7 Unpacking libcsv3:amd64 (3.0.3+dfsg-6) ...
#15 159.8 Selecting previously unselected package libcsv-dev:amd64.
#15 159.8 Preparing to unpack .../542-libcsv-dev_3.0.3+dfsg-6_amd64.deb ...
#15 159.8 Unpacking libcsv-dev:amd64 (3.0.3+dfsg-6) ...
#15 160.0 Selecting previously unselected package libdbi1:amd64.
#15 160.0 Preparing to unpack .../543-libdbi1_0.9.0-6_amd64.deb ...
#15 160.0 Unpacking libdbi1:amd64 (0.9.0-6) ...
#15 160.1 Selecting previously unselected package libdbd-sqlite3:amd64.
#15 160.2 Preparing to unpack .../544-libdbd-sqlite3_0.9.0-11_amd64.deb ...
#15 160.2 Unpacking libdbd-sqlite3:amd64 (0.9.0-11) ...
#15 160.3 Selecting previously unselected package libdbi-dev.
#15 160.3 Preparing to unpack .../545-libdbi-dev_0.9.0-6_amd64.deb ...
#15 160.3 Unpacking libdbi-dev (0.9.0-6) ...
#15 160.5 Selecting previously unselected package libpkgconf3:amd64.
#15 160.5 Preparing to unpack .../546-libpkgconf3_1.8.1-1_amd64.deb ...
#15 160.5 Unpacking libpkgconf3:amd64 (1.8.1-1) ...
#15 160.7 Selecting previously unselected package pkgconf-bin.
#15 160.7 Preparing to unpack .../547-pkgconf-bin_1.8.1-1_amd64.deb ...
#15 160.7 Unpacking pkgconf-bin (1.8.1-1) ...
#15 160.8 Selecting previously unselected package pkgconf:amd64.
#15 160.8 Preparing to unpack .../548-pkgconf_1.8.1-1_amd64.deb ...
#15 160.9 Unpacking pkgconf:amd64 (1.8.1-1) ...
#15 161.0 Selecting previously unselected package pkg-config:amd64.
#15 161.0 Preparing to unpack .../549-pkg-config_1.8.1-1_amd64.deb ...
#15 161.0 Unpacking pkg-config:amd64 (1.8.1-1) ...
#15 161.2 Selecting previously unselected package libdbus-1-dev:amd64.
#15 161.2 Preparing to unpack .../550-libdbus-1-dev_1.14.10-1~deb12u1_amd64.deb ...
#15 161.2 Unpacking libdbus-1-dev:amd64 (1.14.10-1~deb12u1) ...
#15 161.4 Selecting previously unselected package libelf-dev:amd64.
#15 161.4 Preparing to unpack .../551-libelf-dev_0.188-2.1_amd64.deb ...
#15 161.4 Unpacking libelf-dev:amd64 (0.188-2.1) ...
#15 161.5 Selecting previously unselected package libffi-dev:amd64.
#15 161.6 Preparing to unpack .../552-libffi-dev_3.4.4-1_amd64.deb ...
#15 161.6 Unpacking libffi-dev:amd64 (3.4.4-1) ...
#15 161.7 Selecting previously unselected package libfftw3-double3:amd64.
#15 161.7 Preparing to unpack .../553-libfftw3-double3_3.3.10-1_amd64.deb ...
#15 161.8 Unpacking libfftw3-double3:amd64 (3.3.10-1) ...
#15 161.9 Selecting previously unselected package libfftw3-long3:amd64.
#15 161.9 Preparing to unpack .../554-libfftw3-long3_3.3.10-1_amd64.deb ...
#15 162.0 Unpacking libfftw3-long3:amd64 (3.3.10-1) ...
#15 162.1 Selecting previously unselected package libfftw3-quad3:amd64.
#15 162.1 Preparing to unpack .../555-libfftw3-quad3_3.3.10-1_amd64.deb ...
#15 162.1 Unpacking libfftw3-quad3:amd64 (3.3.10-1) ...
#15 162.3 Selecting previously unselected package libfftw3-single3:amd64.
#15 162.3 Preparing to unpack .../556-libfftw3-single3_3.3.10-1_amd64.deb ...
#15 162.3 Unpacking libfftw3-single3:amd64 (3.3.10-1) ...
#15 162.5 Selecting previously unselected package libfftw3-bin.
#15 162.5 Preparing to unpack .../557-libfftw3-bin_3.3.10-1_amd64.deb ...
#15 162.5 Unpacking libfftw3-bin (3.3.10-1) ...
#15 162.7 Selecting previously unselected package libfftw3-dev:amd64.
#15 162.7 Preparing to unpack .../558-libfftw3-dev_3.3.10-1_amd64.deb ...
#15 162.7 Unpacking libfftw3-dev:amd64 (3.3.10-1) ...
#15 163.4 Selecting previously unselected package libgdk-pixbuf2.0-common.
#15 163.4 Preparing to unpack .../559-libgdk-pixbuf2.0-common_2.42.10+dfsg-1+deb12u1_all.deb ...
#15 163.4 Unpacking libgdk-pixbuf2.0-common (2.42.10+dfsg-1+deb12u1) ...
#15 163.6 Selecting previously unselected package shared-mime-info.
#15 163.6 Preparing to unpack .../560-shared-mime-info_2.2-1_amd64.deb ...
#15 163.6 Unpacking shared-mime-info (2.2-1) ...
#15 163.8 Selecting previously unselected package libgdk-pixbuf-2.0-0:amd64.
#15 163.9 Preparing to unpack .../561-libgdk-pixbuf-2.0-0_2.42.10+dfsg-1+deb12u1_amd64.deb ...
#15 163.9 Unpacking libgdk-pixbuf-2.0-0:amd64 (2.42.10+dfsg-1+deb12u1) ...
#15 164.0 Selecting previously unselected package libglib2.0-data.
#15 164.1 Preparing to unpack .../562-libglib2.0-data_2.74.6-2+deb12u5_all.deb ...
#15 164.1 Unpacking libglib2.0-data (2.74.6-2+deb12u5) ...
#15 164.3 Selecting previously unselected package libglib2.0-bin.
#15 164.3 Preparing to unpack .../563-libglib2.0-bin_2.74.6-2+deb12u5_amd64.deb ...
#15 164.3 Unpacking libglib2.0-bin (2.74.6-2+deb12u5) ...
#15 164.4 Selecting previously unselected package libglib2.0-dev-bin.
#15 164.4 Preparing to unpack .../564-libglib2.0-dev-bin_2.74.6-2+deb12u5_amd64.deb ...
#15 164.5 Unpacking libglib2.0-dev-bin (2.74.6-2+deb12u5) ...
#15 164.6 Selecting previously unselected package libsepol-dev:amd64.
#15 164.6 Preparing to unpack .../565-libsepol-dev_3.4-2.1_amd64.deb ...
#15 164.6 Unpacking libsepol-dev:amd64 (3.4-2.1) ...
#15 164.8 Selecting previously unselected package libpcre2-16-0:amd64.
#15 164.8 Preparing to unpack .../566-libpcre2-16-0_10.42-1_amd64.deb ...
#15 164.8 Unpacking libpcre2-16-0:amd64 (10.42-1) ...
#15 165.0 Selecting previously unselected package libpcre2-32-0:amd64.
#15 165.0 Preparing to unpack .../567-libpcre2-32-0_10.42-1_amd64.deb ...
#15 165.0 Unpacking libpcre2-32-0:amd64 (10.42-1) ...
#15 165.2 Selecting previously unselected package libpcre2-posix3:amd64.
#15 165.2 Preparing to unpack .../568-libpcre2-posix3_10.42-1_amd64.deb ...
#15 165.2 Unpacking libpcre2-posix3:amd64 (10.42-1) ...
#15 165.4 Selecting previously unselected package libpcre2-dev:amd64.
#15 165.4 Preparing to unpack .../569-libpcre2-dev_10.42-1_amd64.deb ...
#15 165.4 Unpacking libpcre2-dev:amd64 (10.42-1) ...
#15 165.6 Selecting previously unselected package libselinux1-dev:amd64.
#15 165.6 Preparing to unpack .../570-libselinux1-dev_3.4-1+b6_amd64.deb ...
#15 165.7 Unpacking libselinux1-dev:amd64 (3.4-1+b6) ...
#15 165.8 Selecting previously unselected package libmount-dev:amd64.
#15 165.8 Preparing to unpack .../571-libmount-dev_2.38.1-5+deb12u3_amd64.deb ...
#15 165.8 Unpacking libmount-dev:amd64 (2.38.1-5+deb12u3) ...
#15 166.0 Selecting previously unselected package libglib2.0-dev:amd64.
#15 166.0 Preparing to unpack .../572-libglib2.0-dev_2.74.6-2+deb12u5_amd64.deb ...
#15 166.0 Unpacking libglib2.0-dev:amd64 (2.74.6-2+deb12u5) ...
#15 166.2 Selecting previously unselected package libgmpxx4ldbl:amd64.
#15 166.2 Preparing to unpack .../573-libgmpxx4ldbl_2%3a6.2.1+dfsg1-1.1_amd64.deb ...
#15 166.2 Unpacking libgmpxx4ldbl:amd64 (2:6.2.1+dfsg1-1.1) ...
#15 166.4 Selecting previously unselected package libgmp-dev:amd64.
#15 166.4 Preparing to unpack .../574-libgmp-dev_2%3a6.2.1+dfsg1-1.1_amd64.deb ...
#15 166.4 Unpacking libgmp-dev:amd64 (2:6.2.1+dfsg1-1.1) ...
#15 166.6 Selecting previously unselected package libunbound8:amd64.
#15 166.6 Preparing to unpack .../575-libunbound8_1.17.1-2+deb12u2_amd64.deb ...
#15 166.6 Unpacking libunbound8:amd64 (1.17.1-2+deb12u2) ...
#15 166.8 Selecting previously unselected package libgnutls-dane0:amd64.
#15 166.8 Preparing to unpack .../576-libgnutls-dane0_3.7.9-2+deb12u4_amd64.deb ...
#15 166.8 Unpacking libgnutls-dane0:amd64 (3.7.9-2+deb12u4) ...
#15 167.0 Selecting previously unselected package libgnutls-openssl27:amd64.
#15 167.0 Preparing to unpack .../577-libgnutls-openssl27_3.7.9-2+deb12u4_amd64.deb ...
#15 167.0 Unpacking libgnutls-openssl27:amd64 (3.7.9-2+deb12u4) ...
#15 167.2 Selecting previously unselected package libgnutlsxx30:amd64.
#15 167.2 Preparing to unpack .../578-libgnutlsxx30_3.7.9-2+deb12u4_amd64.deb ...
#15 167.2 Unpacking libgnutlsxx30:amd64 (3.7.9-2+deb12u4) ...
#15 167.3 Selecting previously unselected package libidn2-dev:amd64.
#15 167.3 Preparing to unpack .../579-libidn2-dev_2.3.3-1+b1_amd64.deb ...
#15 167.3 Unpacking libidn2-dev:amd64 (2.3.3-1+b1) ...
#15 167.5 Selecting previously unselected package libp11-kit-dev:amd64.
#15 167.5 Preparing to unpack .../580-libp11-kit-dev_0.24.1-2_amd64.deb ...
#15 167.5 Unpacking libp11-kit-dev:amd64 (0.24.1-2) ...
#15 167.6 Selecting previously unselected package libtasn1-6-dev:amd64.
#15 167.6 Preparing to unpack .../581-libtasn1-6-dev_4.19.0-2+deb12u1_amd64.deb ...
#15 167.7 Unpacking libtasn1-6-dev:amd64 (4.19.0-2+deb12u1) ...
#15 167.8 Selecting previously unselected package nettle-dev:amd64.
#15 167.8 Preparing to unpack .../582-nettle-dev_3.8.1-2_amd64.deb ...
#15 167.8 Unpacking nettle-dev:amd64 (3.8.1-2) ...
#15 168.6 Selecting previously unselected package libgnutls28-dev:amd64.
#15 168.6 Preparing to unpack .../583-libgnutls28-dev_3.7.9-2+deb12u4_amd64.deb ...
#15 168.6 Unpacking libgnutls28-dev:amd64 (3.7.9-2+deb12u4) ...
#15 168.8 Selecting previously unselected package libgps28:amd64.
#15 168.8 Preparing to unpack .../584-libgps28_3.22-4.1+b1_amd64.deb ...
#15 168.9 Unpacking libgps28:amd64 (3.22-4.1+b1) ...
#15 169.0 Selecting previously unselected package libgps-dev:amd64.
#15 169.0 Preparing to unpack .../585-libgps-dev_3.22-4.1+b1_amd64.deb ...
#15 169.0 Unpacking libgps-dev:amd64 (3.22-4.1+b1) ...
#15 169.2 Selecting previously unselected package libgsm1:amd64.
#15 169.3 Preparing to unpack .../586-libgsm1_1.0.22-1_amd64.deb ...
#15 169.3 Unpacking libgsm1:amd64 (1.0.22-1) ...
#15 169.5 Selecting previously unselected package libgsm1-dev:amd64.
#15 169.5 Preparing to unpack .../587-libgsm1-dev_1.0.22-1_amd64.deb ...
#15 169.5 Unpacking libgsm1-dev:amd64 (1.0.22-1) ...
#15 169.7 Selecting previously unselected package libimagequant0:amd64.
#15 169.7 Preparing to unpack .../588-libimagequant0_2.17.0-1_amd64.deb ...
#15 169.7 Unpacking libimagequant0:amd64 (2.17.0-1) ...
#15 169.8 Selecting previously unselected package libjansson-dev:amd64.
#15 169.8 Preparing to unpack .../589-libjansson-dev_2.14-2_amd64.deb ...
#15 169.9 Unpacking libjansson-dev:amd64 (2.14-2) ...
#15 170.0 Selecting previously unselected package libkrb5-dev:amd64.
#15 170.0 Preparing to unpack .../590-libkrb5-dev_1.20.1-2+deb12u2_amd64.deb ...
#15 170.0 Unpacking libkrb5-dev:amd64 (1.20.1-2+deb12u2) ...
#15 170.2 Selecting previously unselected package liblua5.3-0:amd64.
#15 170.2 Preparing to unpack .../591-liblua5.3-0_5.3.6-2_amd64.deb ...
#15 170.2 Unpacking liblua5.3-0:amd64 (5.3.6-2) ...
#15 170.3 Selecting previously unselected package libreadline-dev:amd64.
#15 170.4 Preparing to unpack .../592-libreadline-dev_8.2-1.3_amd64.deb ...
#15 170.4 Unpacking libreadline-dev:amd64 (8.2-1.3) ...
#15 170.5 Selecting previously unselected package liblua5.3-dev:amd64.
#15 170.5 Preparing to unpack .../593-liblua5.3-dev_5.3.6-2_amd64.deb ...
#15 170.5 Unpacking liblua5.3-dev:amd64 (5.3.6-2) ...
#15 170.7 Selecting previously unselected package mysql-common.
#15 170.7 Preparing to unpack .../594-mysql-common_5.8+1.1.0_all.deb ...
#15 170.8 Unpacking mysql-common (5.8+1.1.0) ...
#15 170.9 Selecting previously unselected package mariadb-common.
#15 170.9 Preparing to unpack .../595-mariadb-common_1%3a10.11.11-0+deb12u1_all.deb ...
#15 171.0 Unpacking mariadb-common (1:10.11.11-0+deb12u1) ...
#15 171.1 Selecting previously unselected package libmariadb3:amd64.
#15 171.1 Preparing to unpack .../596-libmariadb3_1%3a10.11.11-0+deb12u1_amd64.deb ...
#15 171.2 Unpacking libmariadb3:amd64 (1:10.11.11-0+deb12u1) ...
#15 171.3 Selecting previously unselected package libmnl-dev:amd64.
#15 171.3 Preparing to unpack .../597-libmnl-dev_1.0.4-3_amd64.deb ...
#15 171.3 Unpacking libmnl-dev:amd64 (1.0.4-3) ...
#15 171.4 Selecting previously unselected package libncurses5-dev:amd64.
#15 171.4 Preparing to unpack .../598-libncurses5-dev_6.4-4_amd64.deb ...
#15 171.5 Unpacking libncurses5-dev:amd64 (6.4-4) ...
#15 171.6 Selecting previously unselected package pci.ids.
#15 171.6 Preparing to unpack .../599-pci.ids_0.0~2023.04.11-1_all.deb ...
#15 171.6 Unpacking pci.ids (0.0~2023.04.11-1) ...
#15 171.8 Selecting previously unselected package libpci3:amd64.
#15 171.8 Preparing to unpack .../600-libpci3_1%3a3.9.0-4_amd64.deb ...
#15 171.8 Unpacking libpci3:amd64 (1:3.9.0-4) ...
#15 171.9 Selecting previously unselected package libsensors-config.
#15 171.9 Preparing to unpack .../601-libsensors-config_1%3a3.6.0-7.1_all.deb ...
#15 172.0 Unpacking libsensors-config (1:3.6.0-7.1) ...
#15 172.1 Selecting previously unselected package libsensors5:amd64.
#15 172.2 Preparing to unpack .../602-libsensors5_1%3a3.6.0-7.1_amd64.deb ...
#15 172.2 Unpacking libsensors5:amd64 (1:3.6.0-7.1) ...
#15 172.4 Selecting previously unselected package libwrap0:amd64.
#15 172.4 Preparing to unpack .../603-libwrap0_7.6.q-32_amd64.deb ...
#15 172.4 Unpacking libwrap0:amd64 (7.6.q-32) ...
#15 172.6 Selecting previously unselected package libsnmp-base.
#15 172.6 Preparing to unpack .../604-libsnmp-base_5.9.3+dfsg-2_all.deb ...
#15 172.6 Unpacking libsnmp-base (5.9.3+dfsg-2) ...
#15 172.8 Selecting previously unselected package libsnmp40:amd64.
#15 172.8 Preparing to unpack .../605-libsnmp40_5.9.3+dfsg-2_amd64.deb ...
#15 172.8 Unpacking libsnmp40:amd64 (5.9.3+dfsg-2) ...
#15 173.2 Selecting previously unselected package libnetsnmptrapd40:amd64.
#15 173.2 Preparing to unpack .../606-libnetsnmptrapd40_5.9.3+dfsg-2_amd64.deb ...
#15 173.2 Unpacking libnetsnmptrapd40:amd64 (5.9.3+dfsg-2) ...
#15 173.4 Selecting previously unselected package libnewlib-dev.
#15 173.4 Preparing to unpack .../607-libnewlib-dev_3.3.0-1.3+deb12u1_all.deb ...
#15 173.4 Unpacking libnewlib-dev (3.3.0-1.3+deb12u1) ...
#15 173.6 Selecting previously unselected package libnewlib-arm-none-eabi.
#15 173.6 Preparing to unpack .../608-libnewlib-arm-none-eabi_3.3.0-1.3+deb12u1_all.deb ...
#15 173.6 Unpacking libnewlib-arm-none-eabi (3.3.0-1.3+deb12u1) ...
#15 174.6 Selecting previously unselected package libnftnl11:amd64.
#15 174.6 Preparing to unpack .../609-libnftnl11_1.2.4-2_amd64.deb ...
#15 174.6 Unpacking libnftnl11:amd64 (1.2.4-2) ...
#15 174.8 Selecting previously unselected package libnftables1:amd64.
#15 174.8 Preparing to unpack .../610-libnftables1_1.0.6-2+deb12u2_amd64.deb ...
#15 174.8 Unpacking libnftables1:amd64 (1.0.6-2+deb12u2) ...
#15 174.9 Selecting previously unselected package libnftables-dev:amd64.
#15 174.9 Preparing to unpack .../611-libnftables-dev_1.0.6-2+deb12u2_amd64.deb ...
#15 175.0 Unpacking libnftables-dev:amd64 (1.0.6-2+deb12u2) ...
#15 175.1 Selecting previously unselected package libnftnl-dev:amd64.
#15 175.1 Preparing to unpack .../612-libnftnl-dev_1.2.4-2_amd64.deb ...
#15 175.1 Unpacking libnftnl-dev:amd64 (1.2.4-2) ...
#15 175.2 Selecting previously unselected package libnorm1:amd64.
#15 175.2 Preparing to unpack .../613-libnorm1_1.5.9+dfsg-2_amd64.deb ...
#15 175.3 Unpacking libnorm1:amd64 (1.5.9+dfsg-2) ...
#15 175.4 Selecting previously unselected package libxml2-dev:amd64.
#15 175.4 Preparing to unpack .../614-libxml2-dev_2.9.14+dfsg-1.3~deb12u1_amd64.deb ...
#15 175.4 Unpacking libxml2-dev:amd64 (2.9.14+dfsg-1.3~deb12u1) ...
#15 175.6 Selecting previously unselected package libnorm-dev:amd64.
#15 175.6 Preparing to unpack .../615-libnorm-dev_1.5.9+dfsg-2_amd64.deb ...
#15 175.6 Unpacking libnorm-dev:amd64 (1.5.9+dfsg-2) ...
#15 175.8 Selecting previously unselected package liboping0:amd64.
#15 175.8 Preparing to unpack .../616-liboping0_1.10.0-5+b1_amd64.deb ...
#15 175.8 Unpacking liboping0:amd64 (1.10.0-5+b1) ...
#15 176.0 Selecting previously unselected package liboping-dev:amd64.
#15 176.0 Preparing to unpack .../617-liboping-dev_1.10.0-5+b1_amd64.deb ...
#15 176.0 Unpacking liboping-dev:amd64 (1.10.0-5+b1) ...
#15 176.2 Selecting previously unselected package libortp16:amd64.
#15 176.2 Preparing to unpack .../618-libortp16_1%3a5.1.64-2_amd64.deb ...
#15 176.2 Unpacking libortp16:amd64 (1:5.1.64-2) ...
#15 176.3 Selecting previously unselected package libortp-dev:amd64.
#15 176.3 Preparing to unpack .../619-libortp-dev_1%3a5.1.64-2_amd64.deb ...
#15 176.4 Unpacking libortp-dev:amd64 (1:5.1.64-2) ...
#15 176.5 Selecting previously unselected package libpcap0.8:amd64.
#15 176.5 Preparing to unpack .../620-libpcap0.8_1.10.3-1_amd64.deb ...
#15 176.5 Unpacking libpcap0.8:amd64 (1.10.3-1) ...
#15 176.7 Selecting previously unselected package libpcap0.8-dev:amd64.
#15 176.7 Preparing to unpack .../621-libpcap0.8-dev_1.10.3-1_amd64.deb ...
#15 176.7 Unpacking libpcap0.8-dev:amd64 (1.10.3-1) ...
#15 176.8 Selecting previously unselected package libpcap-dev:amd64.
#15 176.9 Preparing to unpack .../622-libpcap-dev_1.10.3-1_amd64.deb ...
#15 176.9 Unpacking libpcap-dev:amd64 (1.10.3-1) ...
#15 177.0 Selecting previously unselected package libudev-dev:amd64.
#15 177.0 Preparing to unpack .../623-libudev-dev_252.36-1~deb12u1_amd64.deb ...
#15 177.1 Unpacking libudev-dev:amd64 (252.36-1~deb12u1) ...
#15 177.2 Selecting previously unselected package libpci-dev:amd64.
#15 177.2 Preparing to unpack .../624-libpci-dev_1%3a3.9.0-4_amd64.deb ...
#15 177.2 Unpacking libpci-dev:amd64 (1:3.9.0-4) ...
#15 177.4 Selecting previously unselected package libpcsclite1:amd64.
#15 177.4 Preparing to unpack .../625-libpcsclite1_1.9.9-2_amd64.deb ...
#15 177.4 Unpacking libpcsclite1:amd64 (1.9.9-2) ...
#15 177.6 Selecting previously unselected package libpcsclite-dev:amd64.
#15 177.6 Preparing to unpack .../626-libpcsclite-dev_1.9.9-2_amd64.deb ...
#15 177.6 Unpacking libpcsclite-dev:amd64 (1.9.9-2) ...
#15 177.8 Selecting previously unselected package libpgm-5.3-0:amd64.
#15 177.8 Preparing to unpack .../627-libpgm-5.3-0_5.3.128~dfsg-2_amd64.deb ...
#15 177.8 Unpacking libpgm-5.3-0:amd64 (5.3.128~dfsg-2) ...
#15 177.9 Selecting previously unselected package libpgm-dev:amd64.
#15 177.9 Preparing to unpack .../628-libpgm-dev_5.3.128~dfsg-2_amd64.deb ...
#15 178.0 Unpacking libpgm-dev:amd64 (5.3.128~dfsg-2) ...
#15 178.2 Selecting previously unselected package libraqm0:amd64.
#15 178.2 Preparing to unpack .../629-libraqm0_0.7.0-4.1_amd64.deb ...
#15 178.2 Unpacking libraqm0:amd64 (0.7.0-4.1) ...
#15 178.4 Selecting previously unselected package librsvg2-2:amd64.
#15 178.4 Preparing to unpack .../630-librsvg2-2_2.54.7+dfsg-1~deb12u1_amd64.deb ...
#15 178.4 Unpacking librsvg2-2:amd64 (2.54.7+dfsg-1~deb12u1) ...
#15 178.6 Selecting previously unselected package librsvg2-bin.
#15 178.7 Preparing to unpack .../631-librsvg2-bin_2.54.7+dfsg-1~deb12u1_amd64.deb ...
#15 178.7 Unpacking librsvg2-bin (2.54.7+dfsg-1~deb12u1) ...
#15 178.9 Selecting previously unselected package libsctp1:amd64.
#15 178.9 Preparing to unpack .../632-libsctp1_1.0.19+dfsg-2_amd64.deb ...
#15 178.9 Unpacking libsctp1:amd64 (1.0.19+dfsg-2) ...
#15 179.1 Selecting previously unselected package libsctp-dev:amd64.
#15 179.1 Preparing to unpack .../633-libsctp-dev_1.0.19+dfsg-2_amd64.deb ...
#15 179.1 Unpacking libsctp-dev:amd64 (1.0.19+dfsg-2) ...
#15 179.2 Selecting previously unselected package libsensors-dev:amd64.
#15 179.3 Preparing to unpack .../634-libsensors-dev_1%3a3.6.0-7.1_amd64.deb ...
#15 179.3 Unpacking libsensors-dev:amd64 (1:3.6.0-7.1) ...
#15 179.4 Selecting previously unselected package libsigsegv-dev:amd64.
#15 179.4 Preparing to unpack .../635-libsigsegv-dev_2.14-1_amd64.deb ...
#15 179.4 Unpacking libsigsegv-dev:amd64 (2.14-1) ...
#15 179.6 Selecting previously unselected package libwrap0-dev:amd64.
#15 179.6 Preparing to unpack .../636-libwrap0-dev_7.6.q-32_amd64.deb ...
#15 179.6 Unpacking libwrap0-dev:amd64 (7.6.q-32) ...
#15 179.8 Selecting previously unselected package libssl-dev:amd64.
#15 179.8 Preparing to unpack .../637-libssl-dev_3.0.15-1~deb12u1_amd64.deb ...
#15 179.8 Unpacking libssl-dev:amd64 (3.0.15-1~deb12u1) ...
#15 180.0 Selecting previously unselected package libsnmp-dev.
#15 180.0 Preparing to unpack .../638-libsnmp-dev_5.9.3+dfsg-2_amd64.deb ...
#15 180.1 Unpacking libsnmp-dev (5.9.3+dfsg-2) ...
#15 180.3 Selecting previously unselected package libsodium23:amd64.
#15 180.3 Preparing to unpack .../639-libsodium23_1.0.18-1_amd64.deb ...
#15 180.3 Unpacking libsodium23:amd64 (1.0.18-1) ...
#15 180.4 Selecting previously unselected package libsodium-dev:amd64.
#15 180.4 Preparing to unpack .../640-libsodium-dev_1.0.18-1_amd64.deb ...
#15 180.4 Unpacking libsodium-dev:amd64 (1.0.18-1) ...
#15 180.6 Selecting previously unselected package libsofia-sip-ua0.
#15 180.6 Preparing to unpack .../641-libsofia-sip-ua0_1.12.11+20110422.1+1e14eea~dfsg-6_amd64.deb ...
#15 180.6 Unpacking libsofia-sip-ua0 (1.12.11+20110422.1+1e14eea~dfsg-6) ...
#15 180.8 Selecting previously unselected package libsofia-sip-ua-dev.
#15 180.8 Preparing to unpack .../642-libsofia-sip-ua-dev_1.12.11+20110422.1+1e14eea~dfsg-6_amd64.deb ...
#15 180.8 Unpacking libsofia-sip-ua-dev (1.12.11+20110422.1+1e14eea~dfsg-6) ...
#15 181.0 Selecting previously unselected package libsofia-sip-ua-glib3.
#15 181.0 Preparing to unpack .../643-libsofia-sip-ua-glib3_1.12.11+20110422.1+1e14eea~dfsg-6_amd64.deb ...
#15 181.0 Unpacking libsofia-sip-ua-glib3 (1.12.11+20110422.1+1e14eea~dfsg-6) ...
#15 181.2 Selecting previously unselected package libsofia-sip-ua-glib-dev.
#15 181.2 Preparing to unpack .../644-libsofia-sip-ua-glib-dev_1.12.11+20110422.1+1e14eea~dfsg-6_amd64.deb ...
#15 181.2 Unpacking libsofia-sip-ua-glib-dev (1.12.11+20110422.1+1e14eea~dfsg-6) ...
#15 181.3 Selecting previously unselected package libsource-highlight-common.
#15 181.3 Preparing to unpack .../645-libsource-highlight-common_3.1.9-4.2_all.deb ...
#15 181.4 Unpacking libsource-highlight-common (3.1.9-4.2) ...
#15 181.5 Selecting previously unselected package libsource-highlight4v5:amd64.
#15 181.5 Preparing to unpack .../646-libsource-highlight4v5_3.1.9-4.2+b3_amd64.deb ...
#15 181.5 Unpacking libsource-highlight4v5:amd64 (3.1.9-4.2+b3) ...
#15 181.7 Selecting previously unselected package libsqlite3-dev:amd64.
#15 181.7 Preparing to unpack .../647-libsqlite3-dev_3.40.1-2+deb12u1_amd64.deb ...
#15 181.7 Unpacking libsqlite3-dev:amd64 (3.40.1-2+deb12u1) ...
#15 181.9 Selecting previously unselected package libtalloc2:amd64.
#15 181.9 Preparing to unpack .../648-libtalloc2_2.4.0-f2_amd64.deb ...
#15 181.9 Unpacking libtalloc2:amd64 (2.4.0-f2) ...
#15 182.1 Selecting previously unselected package libtalloc-dev:amd64.
#15 182.1 Preparing to unpack .../649-libtalloc-dev_2.4.0-f2_amd64.deb ...
#15 182.1 Unpacking libtalloc-dev:amd64 (2.4.0-f2) ...
#15 182.2 Selecting previously unselected package libtext-unidecode-perl.
#15 182.3 Preparing to unpack .../650-libtext-unidecode-perl_1.30-3_all.deb ...
#15 182.3 Unpacking libtext-unidecode-perl (1.30-3) ...
#15 182.5 Selecting previously unselected package liburing2:amd64.
#15 182.5 Preparing to unpack .../651-liburing2_2.3-3_amd64.deb ...
#15 182.5 Unpacking liburing2:amd64 (2.3-3) ...
#15 182.6 Selecting previously unselected package liburing-dev:amd64.
#15 182.7 Preparing to unpack .../652-liburing-dev_2.3-3_amd64.deb ...
#15 182.7 Unpacking liburing-dev:amd64 (2.3-3) ...
#15 182.8 Selecting previously unselected package libusb-0.1-4:amd64.
#15 182.8 Preparing to unpack .../653-libusb-0.1-4_2%3a0.1.12-32_amd64.deb ...
#15 182.9 Unpacking libusb-0.1-4:amd64 (2:0.1.12-32) ...
#15 183.0 Selecting previously unselected package libusb-1.0-0-dev:amd64.
#15 183.0 Preparing to unpack .../654-libusb-1.0-0-dev_2%3a1.0.26-1_amd64.deb ...
#15 183.0 Unpacking libusb-1.0-0-dev:amd64 (2:1.0.26-1) ...
#15 183.2 Selecting previously unselected package libusb-dev.
#15 183.2 Preparing to unpack .../655-libusb-dev_2%3a0.1.12-32_amd64.deb ...
#15 183.2 Unpacking libusb-dev (2:0.1.12-32) ...
#15 183.4 Selecting previously unselected package libwebpdemux2:amd64.
#15 183.4 Preparing to unpack .../656-libwebpdemux2_1.2.4-0.2+deb12u1_amd64.deb ...
#15 183.4 Unpacking libwebpdemux2:amd64 (1.2.4-0.2+deb12u1) ...
#15 183.5 Selecting previously unselected package libwebpmux3:amd64.
#15 183.5 Preparing to unpack .../657-libwebpmux3_1.2.4-0.2+deb12u1_amd64.deb ...
#15 183.6 Unpacking libwebpmux3:amd64 (1.2.4-0.2+deb12u1) ...
#15 183.7 Selecting previously unselected package libxml-namespacesupport-perl.
#15 183.7 Preparing to unpack .../658-libxml-namespacesupport-perl_1.12-2_all.deb ...
#15 183.8 Unpacking libxml-namespacesupport-perl (1.12-2) ...
#15 183.9 Selecting previously unselected package libxml-sax-base-perl.
#15 183.9 Preparing to unpack .../659-libxml-sax-base-perl_1.09-3_all.deb ...
#15 183.9 Unpacking libxml-sax-base-perl (1.09-3) ...
#15 184.1 Selecting previously unselected package libxml-sax-perl.
#15 184.1 Preparing to unpack .../660-libxml-sax-perl_1.02+dfsg-3_all.deb ...
#15 184.1 Unpacking libxml-sax-perl (1.02+dfsg-3) ...
#15 184.3 Selecting previously unselected package libxml-libxml-perl.
#15 184.3 Preparing to unpack .../661-libxml-libxml-perl_2.0207+dfsg+really+2.0134-1+b1_amd64.deb ...
#15 184.3 Unpacking libxml-libxml-perl (2.0207+dfsg+really+2.0134-1+b1) ...
#15 184.5 Selecting previously unselected package libyaml-0-2:amd64.
#15 184.5 Preparing to unpack .../662-libyaml-0-2_0.2.5-1_amd64.deb ...
#15 184.5 Unpacking libyaml-0-2:amd64 (0.2.5-1) ...
#15 184.7 Selecting previously unselected package libzmq5:amd64.
#15 184.7 Preparing to unpack .../663-libzmq5_4.3.4-6_amd64.deb ...
#15 184.7 Unpacking libzmq5:amd64 (4.3.4-6) ...
#15 184.8 Selecting previously unselected package libzmq3-dev:amd64.
#15 184.9 Preparing to unpack .../664-libzmq3-dev_4.3.4-6_amd64.deb ...
#15 184.9 Unpacking libzmq3-dev:amd64 (4.3.4-6) ...
#15 185.0 Selecting previously unselected package lua-socket:amd64.
#15 185.1 Preparing to unpack .../665-lua-socket_3.1.0-1+b1_amd64.deb ...
#15 185.1 Unpacking lua-socket:amd64 (3.1.0-1+b1) ...
#15 185.2 Selecting previously unselected package mscgen.
#15 185.2 Preparing to unpack .../666-mscgen_0.20-14_amd64.deb ...
#15 185.2 Unpacking mscgen (0.20-14) ...
#15 185.4 Selecting previously unselected package patchelf.
#15 185.4 Preparing to unpack .../667-patchelf_0.14.3-1+b1_amd64.deb ...
#15 185.4 Unpacking patchelf (0.14.3-1+b1) ...
#15 185.6 Selecting previously unselected package picolibc-arm-none-eabi.
#15 185.6 Preparing to unpack .../668-picolibc-arm-none-eabi_1.8-1_all.deb ...
#15 185.6 Unpacking picolibc-arm-none-eabi (1.8-1) ...
#15 186.5 Selecting previously unselected package python3-setuptools.
#15 186.5 Preparing to unpack .../669-python3-setuptools_66.1.1-1+deb12u1_all.deb ...
#15 186.6 Unpacking python3-setuptools (66.1.1-1+deb12u1) ...
#15 186.8 Selecting previously unselected package python3-six.
#15 186.8 Preparing to unpack .../670-python3-six_1.16.0-4_all.deb ...
#15 186.8 Unpacking python3-six (1.16.0-4) ...
#15 186.9 Selecting previously unselected package python3-typing-extensions.
#15 186.9 Preparing to unpack .../671-python3-typing-extensions_4.4.0-1_all.deb ...
#15 187.0 Unpacking python3-typing-extensions (4.4.0-1) ...
#15 187.1 Selecting previously unselected package python3-lazy-object-proxy.
#15 187.1 Preparing to unpack .../672-python3-lazy-object-proxy_1.9.0-1+b1_amd64.deb ...
#15 187.1 Unpacking python3-lazy-object-proxy (1.9.0-1+b1) ...
#15 187.3 Selecting previously unselected package python3-wrapt.
#15 187.3 Preparing to unpack .../673-python3-wrapt_1.14.1-2+b2_amd64.deb ...
#15 187.3 Unpacking python3-wrapt (1.14.1-2+b2) ...
#15 187.5 Selecting previously unselected package python3-astroid.
#15 187.5 Preparing to unpack .../674-python3-astroid_2.14.2-1_all.deb ...
#15 187.5 Unpacking python3-astroid (2.14.2-1) ...
#15 187.7 Selecting previously unselected package python3-toml.
#15 187.7 Preparing to unpack .../675-python3-toml_0.10.2-1_all.deb ...
#15 187.7 Unpacking python3-toml (0.10.2-1) ...
#15 187.8 Selecting previously unselected package python3-isort.
#15 187.8 Preparing to unpack .../676-python3-isort_5.6.4-1_all.deb ...
#15 187.9 Unpacking python3-isort (5.6.4-1) ...
#15 188.0 Selecting previously unselected package python3-more-itertools.
#15 188.0 Preparing to unpack .../677-python3-more-itertools_8.10.0-2_all.deb ...
#15 188.0 Unpacking python3-more-itertools (8.10.0-2) ...
#15 188.2 Selecting previously unselected package python3-zipp.
#15 188.2 Preparing to unpack .../678-python3-zipp_1.0.0-6_all.deb ...
#15 188.2 Unpacking python3-zipp (1.0.0-6) ...
#15 188.4 Selecting previously unselected package python3-importlib-metadata.
#15 188.4 Preparing to unpack .../679-python3-importlib-metadata_4.12.0-1_all.deb ...
#15 188.4 Unpacking python3-importlib-metadata (4.12.0-1) ...
#15 188.6 Selecting previously unselected package python3-mypy-extensions.
#15 188.6 Preparing to unpack .../680-python3-mypy-extensions_0.4.3-4_all.deb ...
#15 188.6 Unpacking python3-mypy-extensions (0.4.3-4) ...
#15 188.7 Selecting previously unselected package python3-logilab-common.
#15 188.7 Preparing to unpack .../681-python3-logilab-common_1.9.8-1_all.deb ...
#15 188.8 Unpacking python3-logilab-common (1.9.8-1) ...
#15 188.9 Selecting previously unselected package python3-dill.
#15 188.9 Preparing to unpack .../682-python3-dill_0.3.6-1_all.deb ...
#15 188.9 Unpacking python3-dill (0.3.6-1) ...
#15 189.1 Selecting previously unselected package python3-mccabe.
#15 189.1 Preparing to unpack .../683-python3-mccabe_0.7.0-1_all.deb ...
#15 189.1 Unpacking python3-mccabe (0.7.0-1) ...
#15 189.3 Selecting previously unselected package python3-platformdirs.
#15 189.3 Preparing to unpack .../684-python3-platformdirs_2.6.0-1_all.deb ...
#15 189.3 Unpacking python3-platformdirs (2.6.0-1) ...
#15 189.5 Selecting previously unselected package python3-tomlkit.
#15 189.5 Preparing to unpack .../685-python3-tomlkit_0.11.7-1_all.deb ...
#15 189.5 Unpacking python3-tomlkit (0.11.7-1) ...
#15 189.7 Selecting previously unselected package pylint.
#15 189.7 Preparing to unpack .../686-pylint_2.16.2-2_all.deb ...
#15 189.7 Unpacking pylint (2.16.2-2) ...
#15 189.9 Selecting previously unselected package python3-funcparserlib.
#15 189.9 Preparing to unpack .../687-python3-funcparserlib_1.0.0-0.2_all.deb ...
#15 189.9 Unpacking python3-funcparserlib (1.0.0-0.2) ...
#15 190.0 Selecting previously unselected package python3-pil:amd64.
#15 190.0 Preparing to unpack .../688-python3-pil_9.4.0-1.1+deb12u1_amd64.deb ...
#15 190.1 Unpacking python3-pil:amd64 (9.4.0-1.1+deb12u1) ...
#15 190.2 Selecting previously unselected package python3-webcolors.
#15 190.3 Preparing to unpack .../689-python3-webcolors_1.11.1-1_all.deb ...
#15 190.3 Unpacking python3-webcolors (1.11.1-1) ...
#15 190.4 Selecting previously unselected package python3-roman.
#15 190.5 Preparing to unpack .../690-python3-roman_3.3-3_all.deb ...
#15 190.5 Unpacking python3-roman (3.3-3) ...
#15 190.6 Selecting previously unselected package python3-docutils.
#15 190.6 Preparing to unpack .../691-python3-docutils_0.19+dfsg-6_all.deb ...
#15 190.7 Unpacking python3-docutils (0.19+dfsg-6) ...
#15 190.8 Selecting previously unselected package python3-reportlab-accel:amd64.
#15 190.8 Preparing to unpack .../692-python3-reportlab-accel_3.6.12-1+deb12u1_amd64.deb ...
#15 190.8 Unpacking python3-reportlab-accel:amd64 (3.6.12-1+deb12u1) ...
#15 195.0 Selecting previously unselected package python3-reportlab.
#15 195.0 Preparing to unpack .../693-python3-reportlab_3.6.12-1+deb12u1_all.deb ...
#15 195.0 Unpacking python3-reportlab (3.6.12-1+deb12u1) ...
#15 195.2 Selecting previously unselected package python3-blockdiag.
#15 195.2 Preparing to unpack .../694-python3-blockdiag_2.0.1+dfsg-1_all.deb ...
#15 195.2 Unpacking python3-blockdiag (2.0.1+dfsg-1) ...
#15 195.4 Selecting previously unselected package python3-distlib.
#15 195.4 Preparing to unpack .../695-python3-distlib_0.3.6-1_all.deb ...
#15 195.4 Unpacking python3-distlib (0.3.6-1) ...
#15 195.6 Selecting previously unselected package python3-filelock.
#15 195.6 Preparing to unpack .../696-python3-filelock_3.9.0-1_all.deb ...
#15 195.6 Unpacking python3-filelock (3.9.0-1) ...
#15 195.8 Selecting previously unselected package python3-gi.
#15 195.8 Preparing to unpack .../697-python3-gi_3.42.2-3+b1_amd64.deb ...
#15 195.8 Unpacking python3-gi (3.42.2-3+b1) ...
#15 195.9 Selecting previously unselected package python3-markupsafe.
#15 196.0 Preparing to unpack .../698-python3-markupsafe_2.1.2-1+b1_amd64.deb ...
#15 196.0 Unpacking python3-markupsafe (2.1.2-1+b1) ...
#15 196.1 Selecting previously unselected package python3-mako.
#15 196.2 Preparing to unpack .../699-python3-mako_1.2.4+ds-1_all.deb ...
#15 196.2 Unpacking python3-mako (1.2.4+ds-1) ...
#15 196.3 Selecting previously unselected package python3-nwdiag.
#15 196.3 Preparing to unpack .../700-python3-nwdiag_2.0.0+dfsg-1.1_all.deb ...
#15 196.4 Unpacking python3-nwdiag (2.0.0+dfsg-1.1) ...
#15 196.5 Selecting previously unselected package python3-wheel.
#15 196.5 Preparing to unpack .../701-python3-wheel_0.38.4-2_all.deb ...
#15 196.6 Unpacking python3-wheel (0.38.4-2) ...
#15 196.7 Selecting previously unselected package python3-pip.
#15 196.7 Preparing to unpack .../702-python3-pip_23.0.1+dfsg-1_all.deb ...
#15 196.8 Unpacking python3-pip (23.0.1+dfsg-1) ...
#15 197.0 Selecting previously unselected package python3-pip-whl.
#15 197.0 Preparing to unpack .../703-python3-pip-whl_23.0.1+dfsg-1_all.deb ...
#15 197.0 Unpacking python3-pip-whl (23.0.1+dfsg-1) ...
#15 197.2 Selecting previously unselected package python3-pyflakes.
#15 197.2 Preparing to unpack .../704-python3-pyflakes_2.5.0-1_all.deb ...
#15 197.2 Unpacking python3-pyflakes (2.5.0-1) ...
#15 197.3 Selecting previously unselected package python3-setuptools-whl.
#15 197.4 Preparing to unpack .../705-python3-setuptools-whl_66.1.1-1+deb12u1_all.deb ...
#15 197.4 Unpacking python3-setuptools-whl (66.1.1-1+deb12u1) ...
#15 197.6 Selecting previously unselected package python3-usb.
#15 197.6 Preparing to unpack .../706-python3-usb_1.2.1-2_all.deb ...
#15 197.6 Unpacking python3-usb (1.2.1-2) ...
#15 197.7 Selecting previously unselected package python3-wheel-whl.
#15 197.7 Preparing to unpack .../707-python3-wheel-whl_0.38.4-2_all.deb ...
#15 197.7 Unpacking python3-wheel-whl (0.38.4-2) ...
#15 197.9 Selecting previously unselected package python3-virtualenv.
#15 197.9 Preparing to unpack .../708-python3-virtualenv_20.17.1+ds-1_all.deb ...
#15 197.9 Unpacking python3-virtualenv (20.17.1+ds-1) ...
#15 198.1 Selecting previously unselected package python3-yaml.
#15 198.1 Preparing to unpack .../709-python3-yaml_6.0-3+b2_amd64.deb ...
#15 198.1 Unpacking python3-yaml (6.0-3+b2) ...
#15 198.2 Selecting previously unselected package sdcc-libraries.
#15 198.3 Preparing to unpack .../710-sdcc-libraries_4.2.0+dfsg-1_all.deb ...
#15 198.3 Unpacking sdcc-libraries (4.2.0+dfsg-1) ...
#15 198.5 Selecting previously unselected package sdcc.
#15 198.5 Preparing to unpack .../711-sdcc_4.2.0+dfsg-1_amd64.deb ...
#15 198.5 Unpacking sdcc (4.2.0+dfsg-1) ...
#15 198.8 Selecting previously unselected package source-highlight.
#15 198.8 Preparing to unpack .../712-source-highlight_3.1.9-4.2+b3_amd64.deb ...
#15 198.8 Unpacking source-highlight (3.1.9-4.2+b3) ...
#15 199.0 Selecting previously unselected package sqlite3.
#15 199.0 Preparing to unpack .../713-sqlite3_3.40.1-2+deb12u1_amd64.deb ...
#15 199.0 Unpacking sqlite3 (3.40.1-2+deb12u1) ...
#15 199.2 Selecting previously unselected package stow.
#15 199.2 Preparing to unpack .../714-stow_2.3.1-1_all.deb ...
#15 199.2 Unpacking stow (2.3.1-1) ...
#15 199.3 Selecting previously unselected package swig4.0.
#15 199.4 Preparing to unpack .../715-swig4.0_4.1.0-0.2_amd64.deb ...
#15 199.4 Unpacking swig4.0 (4.1.0-0.2) ...
#15 199.6 Selecting previously unselected package swig.
#15 199.6 Preparing to unpack .../716-swig_4.1.0-0.2_all.deb ...
#15 199.6 Unpacking swig (4.1.0-0.2) ...
#15 199.8 Selecting previously unselected package tcpdump.
#15 199.8 Preparing to unpack .../717-tcpdump_4.99.3-1_amd64.deb ...
#15 199.8 Unpacking tcpdump (4.99.3-1) ...
#15 200.0 Selecting previously unselected package telnet.
#15 200.0 Preparing to unpack .../718-telnet_0.17+2.4-2+deb12u1_all.deb ...
#15 200.0 Unpacking telnet (0.17+2.4-2+deb12u1) ...
#15 200.2 Selecting previously unselected package tex-gyre.
#15 200.2 Preparing to unpack .../719-tex-gyre_20180621-6_all.deb ...
#15 200.2 Unpacking tex-gyre (20180621-6) ...
#15 200.6 Selecting previously unselected package texinfo.
#15 200.6 Preparing to unpack .../720-texinfo_6.8-6+b1_amd64.deb ...
#15 200.6 Unpacking texinfo (6.8-6+b1) ...
#15 200.9 Selecting previously unselected package unzip.
#15 200.9 Preparing to unpack .../721-unzip_6.0-28_amd64.deb ...
#15 200.9 Unpacking unzip (6.0-28) ...
#15 201.1 Selecting previously unselected package virtualenv.
#15 201.1 Preparing to unpack .../722-virtualenv_20.17.1+ds-1_all.deb ...
#15 201.1 Unpacking virtualenv (20.17.1+ds-1) ...
#15 201.2 Selecting previously unselected package xxd.
#15 201.2 Preparing to unpack .../723-xxd_2%3a9.0.1378-2+deb12u2_amd64.deb ...
#15 201.3 Unpacking xxd (2:9.0.1378-2+deb12u2) ...
#15 201.4 Setting up libip4tc2:amd64 (1.8.9-2) ...
#15 201.5 Setting up libksba8:amd64 (1.6.3-2) ...
#15 201.6 Setting up libboost-chrono1.74.0:amd64 (1.74.0+ds1-21) ...
#15 201.6 Setting up media-types (10.0.0) ...
#15 201.7 Setting up libpipeline1:amd64 (1.5.7-1) ...
#15 201.8 Setting up libboost-system1.74.0:amd64 (1.74.0+ds1-21) ...
#15 201.8 Setting up libgraphite2-3:amd64 (1.3.14-1) ...
#15 201.9 Setting up liblcms2-2:amd64 (2.14-2) ...
#15 201.9 Setting up libpixman-1-0:amd64 (0.42.2-1) ...
#15 202.0 Setting up libtext-charwidth-perl:amd64 (0.04-11) ...
#15 202.1 Setting up libxapian30:amd64 (1.4.22-1) ...
#15 202.1 Setting up wdiff (1.2.2-5) ...
#15 202.2 Setting up libaom3:amd64 (3.6.0-1+deb12u1) ...
#15 202.2 Setting up libpciaccess0:amd64 (0.17-2) ...
#15 202.3 Setting up mysql-common (5.8+1.1.0) ...
#15 202.4 update-alternatives: using /etc/mysql/my.cnf.fallback to provide /etc/mysql/my.cnf (my.cnf) in auto mode
#15 202.4 Setting up libabsl20220623:amd64 (20220623.1-1) ...
#15 202.5 Setting up libxau6:amd64 (1:1.0.9-1) ...
#15 202.6 Setting up python3-setuptools-whl (66.1.1-1+deb12u1) ...
#15 202.6 Setting up libkeyutils1:amd64 (1.6.3-2) ...
#15 202.7 Setting up libapparmor1:amd64 (3.0.8-3) ...
#15 202.7 Setting up libc-l10n (2.36-9+deb12u10) ...
#15 202.8 Setting up pci.ids (0.0~2023.04.11-1) ...
#15 202.8 Setting up binutils-arm-none-eabi (2.40-2+18+b1) ...
#15 202.9 Setting up libgnutls-openssl27:amd64 (3.7.9-2+deb12u4) ...
#15 202.9 Setting up libsodium23:amd64 (1.0.18-1) ...
#15 203.0 Setting up libicu72:amd64 (72.1-3) ...
#15 203.1 Setting up libboost-atomic1.74.0:amd64 (1.74.0+ds1-21) ...
#15 203.1 Setting up liblerc4:amd64 (4.0.0+ds-2) ...
#15 203.2 Setting up libdbi1:amd64 (0.9.0-6) ...
#15 203.3 Setting up bsdextrautils (2.38.1-5+deb12u3) ...
#15 203.3 Setting up fonts-gfs-porson (1.1-7) ...
#15 203.4 Setting up libdatrie1:amd64 (0.2.13-2+b1) ...
#15 203.4 Setting up libmagic-mgc (1:5.44-3) ...
#15 203.5 Setting up libgsm1:amd64 (1.0.22-1) ...
#15 203.5 Setting up python3-pip-whl (23.0.1+dfsg-1) ...
#15 203.6 Setting up gawk (1:5.2.1-2) ...
#15 203.7 Setting up libyaml-0-2:amd64 (0.2.5-1) ...
#15 203.8 Setting up libsigsegv-dev:amd64 (2.14-1) ...
#15 203.8 Setting up libglib2.0-0:amd64 (2.74.6-2+deb12u5) ...
#15 203.9 No schema files found: doing nothing.
#15 203.9 Setting up distro-info-data (0.58+deb12u3) ...
#15 204.0 Setting up libboost-iostreams1.74.0:amd64 (1.74.0+ds1-21) ...
#15 204.0 Setting up libsnmp-base (5.9.3+dfsg-2) ...
#15 204.1 Setting up libboost-program-options1.74.0:amd64 (1.74.0+ds1-21) ...
#15 204.2 Setting up libtirpc-common (1.3.3+ds-1) ...
#15 204.2 Setting up libpgm-5.3-0:amd64 (5.3.128~dfsg-2) ...
#15 204.3 Setting up libargon2-1:amd64 (0~20171227-0.3+deb12u1) ...
#15 204.4 Setting up libijs-0.35:amd64 (0.35-15) ...
#15 204.4 Setting up unzip (6.0-28) ...
#15 204.5 Setting up libcbor0.8:amd64 (0.8.0-2+b1) ...
#15 204.5 Setting up libtexluajit2:amd64 (2022.20220321.62855-5.1+deb12u2) ...
#15 204.6 Setting up libgs-common (10.0.0~dfsg-11+deb12u7) ...
#15 204.6 Setting up libbrotli1:amd64 (1.0.9-2+b6) ...
#15 204.7 Setting up libfontbox-java (1:1.8.16-2) ...
#15 204.8 Setting up libsqlite3-0:amd64 (3.40.1-2+deb12u1) ...
#15 204.8 Setting up liblab-gamut1:amd64 (2.42.2-7+deb12u1) ...
#15 204.9 Setting up libgdk-pixbuf2.0-common (2.42.10+dfsg-1+deb12u1) ...
#15 204.9 Setting up libnorm1:amd64 (1.5.9+dfsg-2) ...
#15 205.0 Setting up binutils-common:amd64 (2.40-2) ...
#15 205.1 Setting up x11-common (1:7.7+23) ...
#15 205.4 debconf: unable to initialize frontend: Dialog
#15 205.4 debconf: (TERM is not set, so the dialog frontend is not usable.)
#15 205.4 debconf: falling back to frontend: Readline
#15 205.4 debconf: unable to initialize frontend: Readline
#15 205.4 debconf: (This frontend requires a controlling tty.)
#15 205.4 debconf: falling back to frontend: Teletype
#15 205.4 invoke-rc.d: could not determine current runlevel
#15 205.4 invoke-rc.d: policy-rc.d denied execution of restart.
#15 205.4 Setting up libsensors-config (1:3.6.0-7.1) ...
#15 205.5 Setting up libboost-stacktrace1.74.0:amd64 (1.74.0+ds1-21) ...
#15 205.6 Setting up libnghttp2-14:amd64 (1.52.0-1+deb12u2) ...
#15 205.6 Setting up libmagic1:amd64 (1:5.44-3) ...
#15 205.7 Setting up libdeflate0:amd64 (1.14-1) ...
#15 205.8 Setting up perl-openssl-defaults:amd64 (7+b1) ...
#15 205.9 Setting up linux-libc-dev:amd64 (6.1.129-1) ...
#15 205.9 Setting up bc (1.07.1-3+b1) ...
#15 206.0 Setting up libctf-nobfd0:amd64 (2.40-2) ...
#15 206.0 Setting up gettext-base (0.21-12) ...
#15 206.1 Setting up m4 (1.4.19-3) ...
#15 206.2 Setting up libboost-nowide1.74.0 (1.74.0+ds1-21) ...
#15 206.2 Setting up lua-socket:amd64 (3.1.0-1+b1) ...
#15 206.3 Setting up libboost-filesystem1.74.0:amd64 (1.74.0+ds1-21) ...
#15 206.3 Setting up libnpth0:amd64 (1.6-3) ...
#15 206.4 Setting up autoconf-archive (20220903-3) ...
#15 206.5 Setting up libzzip-0-13:amd64 (0.13.72+dfsg.1-1.1) ...
#15 206.6 Setting up libc-ares2:amd64 (1.18.1-3) ...
#15 206.6 Setting up file (1:5.44-3) ...
#15 206.7 Setting up libsvtav1enc1:amd64 (1.4.1+dfsg-1) ...
#15 206.7 Setting up libassuan0:amd64 (2.5.5-5) ...
#15 206.8 Setting up libdecaf0:amd64 (1.0.2-2) ...
#15 206.8 Setting up libgomp1:amd64 (12.2.0-14) ...
#15 206.9 Setting up bzip2 (1.0.8-5+b1) ...
#15 206.9 Setting up libffi-dev:amd64 (3.4.4-1) ...
#15 207.0 Setting up locales (2.36-9+deb12u10) ...
#15 207.1 debconf: unable to initialize frontend: Dialog
#15 207.1 debconf: (TERM is not set, so the dialog frontend is not usable.)
#15 207.1 debconf: falling back to frontend: Readline
#15 207.1 debconf: unable to initialize frontend: Readline
#15 207.1 debconf: (This frontend requires a controlling tty.)
#15 207.1 debconf: falling back to frontend: Teletype
#15 208.0 Generating locales (this might take a while)...
#15 208.0 Generation complete.
#15 208.0 Setting up libopts25:amd64 (1:5.18.16-5) ...
#15 208.1 Setting up libtext-wrapi18n-perl (0.06-10) ...
#15 208.1 Setting up libjbig0:amd64 (2.1-6.1) ...
#15 208.2 Setting up librav1e0:amd64 (0.5.1-6) ...
#15 208.3 Setting up libpcre2-16-0:amd64 (10.42-1) ...
#15 208.3 Setting up xxd (2:9.0.1378-2+deb12u2) ...
#15 208.4 Setting up libsource-highlight-common (3.1.9-4.2) ...
#15 208.4 Setting up libfakeroot:amd64 (1.31-1.2) ...
#15 208.5 Setting up libjansson4:amd64 (2.14-2) ...
#15 208.6 Setting up libusb-0.1-4:amd64 (2:0.1.12-32) ...
#15 208.6 Setting up poppler-data (0.4.12-1) ...
#15 208.8 Setting up libkrb5support0:amd64 (1.20.1-2+deb12u2) ...
#15 208.9 Setting up libsasl2-modules-db:amd64 (2.1.28+dfsg-10) ...
#15 208.9 Setting up libosp5 (1.5.2-13+b2) ...
#15 209.0 Setting up libcap2-bin (1:2.66-4) ...
#15 209.1 Setting up fakeroot (1.31-1.2) ...
#15 209.2 update-alternatives: using /usr/bin/fakeroot-sysv to provide /usr/bin/fakeroot (fakeroot) in auto mode
#15 209.2 update-alternatives: warning: skip creation of /usr/share/man/man1/fakeroot.1.gz because associated file /usr/share/man/man1/fakeroot-sysv.1.gz (of link group fakeroot) doesn't exist
#15 209.2 update-alternatives: warning: skip creation of /usr/share/man/man1/faked.1.gz because associated file /usr/share/man/man1/faked-sysv.1.gz (of link group fakeroot) doesn't exist
#15 209.2 update-alternatives: warning: skip creation of /usr/share/man/es/man1/fakeroot.1.gz because associated file /usr/share/man/es/man1/fakeroot-sysv.1.gz (of link group fakeroot) doesn't exist
#15 209.2 update-alternatives: warning: skip creation of /usr/share/man/es/man1/faked.1.gz because associated file /usr/share/man/es/man1/faked-sysv.1.gz (of link group fakeroot) doesn't exist
#15 209.2 update-alternatives: warning: skip creation of /usr/share/man/fr/man1/fakeroot.1.gz because associated file /usr/share/man/fr/man1/fakeroot-sysv.1.gz (of link group fakeroot) doesn't exist
#15 209.2 update-alternatives: warning: skip creation of /usr/share/man/fr/man1/faked.1.gz because associated file /usr/share/man/fr/man1/faked-sysv.1.gz (of link group fakeroot) doesn't exist
#15 209.2 update-alternatives: warning: skip creation of /usr/share/man/sv/man1/fakeroot.1.gz because associated file /usr/share/man/sv/man1/fakeroot-sysv.1.gz (of link group fakeroot) doesn't exist
#15 209.2 update-alternatives: warning: skip creation of /usr/share/man/sv/man1/faked.1.gz because associated file /usr/share/man/sv/man1/faked-sysv.1.gz (of link group fakeroot) doesn't exist
#15 209.2 Setting up libtalloc2:amd64 (2.4.0-f2) ...
#15 209.3 Setting up libgts-0.7-5:amd64 (0.7.6+darcs121130-5+b1) ...
#15 209.3 Setting up mariadb-common (1:10.11.11-0+deb12u1) ...
#15 209.4 update-alternatives: using /etc/mysql/mariadb.cnf to provide /etc/mysql/my.cnf (my.cnf) in auto mode
#15 209.4 Setting up libasound2-data (1.2.8-1) ...
#15 209.5 Setting up libpcre3:amd64 (2:8.39-15) ...
#15 209.5 Setting up libfontenc1:amd64 (1:1.1.4-1) ...
#15 209.6 Setting up perl-modules-5.36 (5.36.0-7+deb12u1) ...
#15 209.6 Setting up autotools-dev (20220109.1) ...
#15 209.7 Setting up libz3-4:amd64 (4.8.12-3.1) ...
#15 209.8 Setting up libpcre2-32-0:amd64 (10.42-1) ...
#15 209.8 Setting up libglib2.0-data (2.74.6-2+deb12u5) ...
#15 209.9 Setting up libpkgconf3:amd64 (1.8.1-1) ...
#15 210.0 Setting up libgmpxx4ldbl:amd64 (2:6.2.1+dfsg1-1.1) ...
#15 210.0 Setting up libuv1:amd64 (1.44.2-1+deb12u1) ...
#15 210.1 Setting up rpcsvc-proto (1.4.3-1) ...
#15 210.1 Setting up libmunge2 (0.5.15-2) ...
#15 210.2 Setting up libboost-test1.74.0:amd64 (1.74.0+ds1-21) ...
#15 210.2 Setting up libjpeg62-turbo:amd64 (1:2.1.5-2) ...
#15 210.3 Setting up libmbedcrypto7:amd64 (2.28.3-1) ...
#15 210.4 Setting up libx11-data (2:1.8.4-2+deb12u2) ...
#15 210.4 Setting up make (4.3-4.1) ...
#15 210.5 Setting up gnupg-l10n (2.2.40-1.1) ...
#15 210.5 Setting up libjbig2dec0:amd64 (0.19-3) ...
#15 210.6 Setting up librtmp1:amd64 (2.4+20151223.gitfa8646d.1-2+b2) ...
#15 210.6 Setting up libteckit0:amd64 (2.5.11+ds1-1+b1) ...
#15 210.7 Setting up libpgm-dev:amd64 (5.3.128~dfsg-2) ...
#15 210.8 Setting up libgnutlsxx30:amd64 (3.7.9-2+deb12u4) ...
#15 210.8 Setting up libpathplan4:amd64 (2.42.2-7+deb12u1) ...
#15 210.9 Setting up libapache-pom-java (29-2) ...
#15 210.9 Setting up libavahi-common-data:amd64 (0.8-10+deb12u1) ...
#15 211.0 Setting up libann0 (1.1.2+doc-9+b1) ...
#15 211.1 Setting up libncurses6:amd64 (6.4-4) ...
#15 211.1 Setting up libdbus-1-3:amd64 (1.14.10-1~deb12u1) ...
#15 211.2 Setting up xz-utils (5.4.1-0.2) ...
#15 211.2 update-alternatives: using /usr/bin/xz to provide /usr/bin/lzma (lzma) in auto mode
#15 211.2 update-alternatives: warning: skip creation of /usr/share/man/man1/lzma.1.gz because associated file /usr/share/man/man1/xz.1.gz (of link group lzma) doesn't exist
#15 211.2 update-alternatives: warning: skip creation of /usr/share/man/man1/unlzma.1.gz because associated file /usr/share/man/man1/unxz.1.gz (of link group lzma) doesn't exist
#15 211.2 update-alternatives: warning: skip creation of /usr/share/man/man1/lzcat.1.gz because associated file /usr/share/man/man1/xzcat.1.gz (of link group lzma) doesn't exist
#15 211.2 update-alternatives: warning: skip creation of /usr/share/man/man1/lzmore.1.gz because associated file /usr/share/man/man1/xzmore.1.gz (of link group lzma) doesn't exist
#15 211.2 update-alternatives: warning: skip creation of /usr/share/man/man1/lzless.1.gz because associated file /usr/share/man/man1/xzless.1.gz (of link group lzma) doesn't exist
#15 211.2 update-alternatives: warning: skip creation of /usr/share/man/man1/lzdiff.1.gz because associated file /usr/share/man/man1/xzdiff.1.gz (of link group lzma) doesn't exist
#15 211.2 update-alternatives: warning: skip creation of /usr/share/man/man1/lzcmp.1.gz because associated file /usr/share/man/man1/xzcmp.1.gz (of link group lzma) doesn't exist
#15 211.2 update-alternatives: warning: skip creation of /usr/share/man/man1/lzgrep.1.gz because associated file /usr/share/man/man1/xzgrep.1.gz (of link group lzma) doesn't exist
#15 211.2 update-alternatives: warning: skip creation of /usr/share/man/man1/lzegrep.1.gz because associated file /usr/share/man/man1/xzegrep.1.gz (of link group lzma) doesn't exist
#15 211.2 update-alternatives: warning: skip creation of /usr/share/man/man1/lzfgrep.1.gz because associated file /usr/share/man/man1/xzfgrep.1.gz (of link group lzma) doesn't exist
#15 211.3 Setting up xfonts-encodings (1:1.0.4-2.2) ...
#15 211.3 Setting up libboost-nowide1.74-dev (1.74.0+ds1-21) ...
#15 211.4 Setting up libfribidi0:amd64 (1.0.8-2.1) ...
#15 211.4 Setting up libboost-regex1.74.0:amd64 (1.74.0+ds1-21) ...
#15 211.5 Setting up t1utils (1.41-4) ...
#15 211.5 Setting up libnewlib-dev (3.3.0-1.3+deb12u1) ...
#15 211.6 Setting up libquadmath0:amd64 (12.2.0-14) ...
#15 211.7 Setting up libtexlua53-5:amd64 (2022.20220321.62855-5.1+deb12u2) ...
#15 211.7 Setting up libimagequant0:amd64 (2.17.0-1) ...
#15 211.8 Setting up libproc2-0:amd64 (2:4.0.2-3) ...
#15 211.8 Setting up libgsm1-dev:amd64 (1.0.22-1) ...
#15 211.9 Setting up libssl-dev:amd64 (3.0.15-1~deb12u1) ...
#15 212.0 Setting up libpng16-16:amd64 (1.6.39-2) ...
#15 212.0 Setting up libhwloc15:amd64 (2.9.0-1) ...
#15 212.1 Setting up libmpc3:amd64 (1.3.1-1) ...
#15 212.1 Setting up libmnl0:amd64 (1.0.4-3) ...
#15 212.2 Setting up libc-ares-dev:amd64 (1.18.1-3) ...
#15 212.2 Setting up libevent-core-2.1-7:amd64 (2.1.12-stable-8) ...
#15 212.3 Setting up liboping0:amd64 (1.10.0-5+b1) ...
#15 212.4 Setting up libatomic1:amd64 (12.2.0-14) ...
#15 212.4 Setting up libboost-context1.74.0:amd64 (1.74.0+ds1-21) ...
#15 212.5 Setting up libtinyxml2-9:amd64 (9.0.0+dfsg-3.1) ...
#15 212.6 Setting up libidn12:amd64 (1.41-1) ...
#15 212.6 Setting up libevent-2.1-7:amd64 (2.1.12-stable-8) ...
#15 212.7 Setting up patch (2.7.6-7) ...
#15 212.7 Setting up libboost-graph1.74.0:amd64 (1.74.0+ds1-21) ...
#15 212.8 Setting up libboost-random1.74.0:amd64 (1.74.0+ds1-21) ...
#15 212.9 Setting up autopoint (0.21-12) ...
#15 212.9 Setting up libjsoncpp25:amd64 (1.9.5-4) ...
#15 213.0 Setting up icu-devtools (72.1-3) ...
#15 213.0 Setting up sudo (1.9.13p3-1+deb12u1) ...
#15 213.2 invoke-rc.d: could not determine current runlevel
#15 213.2 invoke-rc.d: policy-rc.d denied execution of start.
#15 213.3 Setting up ocaml-base (4.13.1-4) ...
#15 213.3 Setting up libmariadb3:amd64 (1:10.11.11-0+deb12u1) ...
#15 213.4 Setting up fonts-dejavu-core (2.37-6) ...
#15 213.7 Setting up libudev-dev:amd64 (252.36-1~deb12u1) ...
#15 213.8 Setting up libgav1-1:amd64 (0.18.0-1+b1) ...
#15 213.8 Setting up libsepol-dev:amd64 (3.4-2.1) ...
#15 213.9 Setting up libpcsclite1:amd64 (1.9.9-2) ...
#15 213.9 Setting up libboost1.74-tools-dev (1.74.0+ds1-21) ...
#15 214.0 Setting up pkgconf-bin (1.8.1-1) ...
#15 214.0 Setting up libsensors5:amd64 (1:3.6.0-7.1) ...
#15 214.1 Setting up libsodium-dev:amd64 (1.0.18-1) ...
#15 214.2 Setting up sdcc-libraries (4.2.0+dfsg-1) ...
#15 214.2 Setting up libpcsclite-dev:amd64 (1.9.9-2) ...
#15 214.3 Setting up libncursesw6:amd64 (6.4-4) ...
#15 214.3 Setting up libk5crypto3:amd64 (1.20.1-2+deb12u2) ...
#15 214.4 Setting up libxtables12:amd64 (1.8.9-2) ...
#15 214.5 Setting up lynx-common (2.9.0dev.12-1) ...
#15 214.6 Setting up libgc1:amd64 (1:8.2.2-3) ...
#15 214.6 Setting up libdav1d6:amd64 (1.0.0-2+deb12u1) ...
#15 214.7 Setting up libltdl7:amd64 (2.4.7-7~deb12u1) ...
#15 214.7 Setting up libfftw3-double3:amd64 (3.3.10-1) ...
#15 214.8 Setting up libidn2-dev:amd64 (2.3.3-1+b1) ...
#15 214.9 Setting up libnewlib-arm-none-eabi (3.3.0-1.3+deb12u1) ...
#15 214.9 Setting up libkpathsea6:amd64 (2022.20220321.62855-5.1+deb12u2) ...
#15 215.0 Setting up libsasl2-2:amd64 (2.1.28+dfsg-10) ...
#15 215.1 Setting up libgfortran5:amd64 (12.2.0-14) ...
#15 215.1 Setting up libwebp7:amd64 (1.2.4-0.2+deb12u1) ...
#15 215.2 Setting up libfdisk1:amd64 (2.38.1-5+deb12u3) ...
#15 215.2 Setting up libboost-math1.74.0:amd64 (1.74.0+ds1-21) ...
#15 215.3 Setting up libubsan1:amd64 (12.2.0-14) ...
#15 215.4 Setting up libboost-serialization1.74.0:amd64 (1.74.0+ds1-21) ...
#15 215.4 Setting up libstdcompat-ocaml (19-1) ...
#15 215.5 Setting up libpci3:amd64 (1:3.9.0-4) ...
#15 215.5 Setting up libnuma1:amd64 (2.0.16-1) ...
#15 215.6 Setting up libpcre2-posix3:amd64 (10.42-1) ...
#15 215.7 Setting up libsctp1:amd64 (1.0.19+dfsg-2) ...
#15 215.7 Setting up python-apt-common (2.6.0) ...
#15 215.8 Setting up libboost-container1.74.0:amd64 (1.74.0+ds1-21) ...
#15 215.9 Setting up libostyle1c2 (1.4devel1-22) ...
#15 215.9 Setting up fonts-gfs-baskerville (1.1-6) ...
#15 216.0 Setting up sensible-utils (0.0.17+nmu1) ...
#15 216.1 Setting up ocl-icd-libopencl1:amd64 (2.3.1-1) ...
#15 216.1 Setting up librhash0:amd64 (1.4.3-3) ...
#15 216.2 Setting up libcrypt-dev:amd64 (1:4.4.33-2) ...
#15 216.3 Setting up libtiff6:amd64 (4.5.0-6+deb12u2) ...
#15 216.3 Setting up dbus-session-bus-common (1.14.10-1~deb12u1) ...
#15 216.4 Setting up libasan8:amd64 (12.2.0-14) ...
#15 216.4 Setting up libuchardet0:amd64 (0.0.7-1) ...
#15 216.5 Setting up liblua5.3-0:amd64 (5.3.6-2) ...
#15 216.6 Setting up procps (2:4.0.2-3) ...
#15 216.7 Setting up libasound2:amd64 (1.2.8-1+b1) ...
#15 216.8 Setting up libmd-dev:amd64 (1.0.4-2) ...
#15 216.8 Setting up libnl-3-200:amd64 (3.7.0-0.2+b1) ...
#15 216.9 Setting up bison (2:3.8.2+dfsg-1+b1) ...
#15 217.0 update-alternatives: using /usr/bin/bison.yacc to provide /usr/bin/yacc (yacc) in auto mode
#15 217.0 update-alternatives: warning: skip creation of /usr/share/man/man1/yacc.1.gz because associated file /usr/share/man/man1/bison.yacc.1.gz (of link group yacc) doesn't exist
#15 217.0 Setting up gpgconf (2.2.40-1.1) ...
#15 217.1 Setting up libpsm2-2 (11.2.185-2) ...
#15 217.1 Setting up openmpi-common (4.1.4-3) ...
#15 217.2 Setting up fonts-lmodern (2.005-1) ...
#15 217.2 Setting up libopenjp2-7:amd64 (2.5.0-2+deb12u1) ...
#15 217.3 Setting up git-man (1:2.39.5-0+deb12u2) ...
#15 217.4 Setting up libthai-data (0.1.29-1) ...
#15 217.4 Setting up libgirepository-1.0-1:amd64 (1.74.0-3) ...
#15 217.5 Setting up libssh2-1:amd64 (1.10.0-3+b1) ...
#15 217.5 Setting up netbase (6.4) ...
#15 217.7 Setting up sgml-base (1.31) ...
#15 217.8 Setting up libsofia-sip-ua0 (1.12.11+20110422.1+1e14eea~dfsg-6) ...
#15 217.9 Setting up cmake-data (3.25.1-1) ...
#15 218.0 Setting up libcdt5:amd64 (2.42.2-7+deb12u1) ...
#15 218.0 Setting up libkrb5-3:amd64 (1.20.1-2+deb12u2) ...
#15 218.1 Setting up libcgraph6:amd64 (2.42.2-7+deb12u1) ...
#15 218.1 Setting up libusb-1.0-0:amd64 (2:1.0.26-1) ...
#15 218.2 Setting up libsensors-dev:amd64 (1:3.6.0-7.1) ...
#15 218.3 Setting up libpsm-infinipath1 (3.3+20.604758e7-6.2) ...
#15 218.3 update-alternatives: using /usr/lib/libpsm1/libpsm_infinipath.so.1.16 to provide /usr/lib/x86_64-linux-gnu/libpsm_infinipath.so.1 (libpsm_infinipath.so.1) in auto mode
#15 218.3 Setting up libtsan2:amd64 (12.2.0-14) ...
#15 218.4 Setting up libjs-jquery (3.6.1+dfsg+~3.5.14-1) ...
#15 218.5 Setting up libboost-date-time1.74.0:amd64 (1.74.0+ds1-21) ...
#15 218.5 Setting up libbinutils:amd64 (2.40-2) ...
#15 218.6 Setting up liburing2:amd64 (2.3-3) ...
#15 218.6 Setting up patchelf (0.14.3-1+b1) ...
#15 218.8 Setting up dbus-system-bus-common (1.14.10-1~deb12u1) ...
#15 219.1 Setting up swig4.0 (4.1.0-0.2) ...
#15 219.1 Setting up libfido2-1:amd64 (1.12.0-2+b1) ...
#15 219.2 Setting up libboost-python1.74.0 (1.74.0+ds1-21) ...
#15 219.2 Setting up libisl23:amd64 (0.25-1.1) ...
#15 219.3 Setting up libaio1:amd64 (0.3.113-4) ...
#15 219.4 Setting up libasound2-dev:amd64 (1.2.8-1+b1) ...
#15 219.4 Setting up libde265-0:amd64 (1.0.11-1+deb12u2) ...
#15 219.5 Setting up libboost-fiber1.74.0:amd64 (1.74.0+ds1-21) ...
#15 219.5 Setting up libc-dev-bin (2.36-9+deb12u10) ...
#15 219.6 Setting up liboping-dev:amd64 (1.10.0-5+b1) ...
#15 219.6 Setting up libtasn1-6-dev:amd64 (4.19.0-2+deb12u1) ...
#15 219.7 Setting up libwebpmux3:amd64 (1.2.4-0.2+deb12u1) ...
#15 219.8 Setting up libbsd0:amd64 (0.11.7-2) ...
#15 219.8 Setting up libparmap-ocaml (1.2.5-1) ...
#15 219.9 Setting up python3-wheel-whl (0.38.4-2) ...
#15 219.9 Setting up libyuv0:amd64 (0.0~git20230123.b2528b0-1) ...
#15 220.0 Setting up libelf1:amd64 (0.188-2.1) ...
#15 220.0 Setting up libjson-c5:amd64 (0.16-2) ...
#15 220.1 Setting up libboost-timer1.74.0:amd64 (1.74.0+ds1-21) ...
#15 220.2 Setting up openjade (1.4devel1-22) ...
#15 220.3 Setting up libxml2:amd64 (2.9.14+dfsg-1.3~deb12u1) ...
#15 222.6 Setting up xdg-utils (1.1.3-4.1) ...
#15 223.3 update-alternatives: using /usr/bin/xdg-open to provide /usr/bin/open (open) in auto mode
#15 223.3 update-alternatives: warning: skip creation of /usr/share/man/man1/open.1.gz because associated file /usr/share/man/man1/xdg-open.1.gz (of link group open) doesn't exist
#15 223.3 Setting up libbsd-dev:amd64 (0.11.7-2) ...
#15 223.3 Setting up libcc1-0:amd64 (12.2.0-14) ...
#15 223.4 Setting up libjansson-dev:amd64 (2.14-2) ...
#15 223.5 Setting up dbus-bin (1.14.10-1~deb12u1) ...
#15 223.5 Setting up sqlite3 (3.40.1-2+deb12u1) ...
#15 223.6 Setting up gpg (2.2.40-1.1) ...
#15 223.6 Setting up libgps28:amd64 (3.22-4.1+b1) ...
#15 223.7 Setting up libbpf1:amd64 (1:1.1.0-1) ...
#15 223.8 Setting up liblsan0:amd64 (12.2.0-14) ...
#15 223.8 Setting up libp11-kit-dev:amd64 (0.24.1-2) ...
#15 223.9 Setting up libitm1:amd64 (12.2.0-14) ...
#15 223.9 Setting up libsofia-sip-ua-glib3 (1.12.11+20110422.1+1e14eea~dfsg-6) ...
#15 224.0 Setting up libsource-highlight4v5:amd64 (3.1.9-4.2+b3) ...
#15 224.0 Setting up libsynctex2:amd64 (2022.20220321.62855-5.1+deb12u2) ...
#15 224.1 Setting up libkmod2:amd64 (30+20221128-1) ...
#15 224.2 Setting up libgdbm6:amd64 (1.23-3) ...
#15 224.2 Setting up libjs-underscore (1.13.4~dfsg+~1.11.4-3) ...
#15 224.3 Setting up libpopt0:amd64 (1.19+dfsg-1) ...
#15 224.3 Setting up libboost-thread1.74.0:amd64 (1.74.0+ds1-21) ...
#15 224.4 Setting up libboost-numpy1.74.0 (1.74.0+ds1-21) ...
#15 224.5 Setting up gnupg-utils (2.2.40-1.1) ...
#15 224.5 Setting up libevent-pthreads-2.1-7:amd64 (2.1.12-stable-8) ...
#15 224.6 Setting up libhiredis0.14:amd64 (0.14.1-3) ...
#15 224.6 Setting up libcsv3:amd64 (3.0.3+dfsg-6) ...
#15 224.7 Setting up libctf0:amd64 (2.40-2) ...
#15 224.8 Setting up pinentry-curses (1.2.1-1) ...
#15 224.8 Setting up libdbi-dev (0.9.0-6) ...
#15 224.9 Setting up teckit (2.5.11+ds1-1+b1) ...
#15 225.0 Setting up libice6:amd64 (2:1.0.10-1) ...
#15 225.0 Setting up libboost-log1.74.0 (1.74.0+ds1-21) ...
#15 225.1 Setting up libxdmcp6:amd64 (1:1.1.2-3) ...
#15 225.1 Setting up libevent-extra-2.1-7:amd64 (2.1.12-stable-8) ...
#15 225.2 Setting up flex (2.6.4-8.2) ...
#15 225.2 Setting up cpp-12 (12.2.0-14) ...
#15 225.3 Setting up libxcb1:amd64 (1.15-1) ...
#15 225.4 Setting up gettext (0.21-12) ...
#15 225.4 Setting up libfftw3-single3:amd64 (3.3.10-1) ...
#15 225.5 Setting up swig (4.1.0-0.2) ...
#15 225.5 Setting up libgmp-dev:amd64 (2:6.2.1+dfsg1-1.1) ...
#15 225.6 Setting up gpg-agent (2.2.40-1.1) ...
#15 225.8 Created symlink /etc/systemd/user/sockets.target.wants/gpg-agent-browser.socket → /usr/lib/systemd/user/gpg-agent-browser.socket.
#15 225.8 Created symlink /etc/systemd/user/sockets.target.wants/gpg-agent-extra.socket → /usr/lib/systemd/user/gpg-agent-extra.socket.
#15 225.9 Created symlink /etc/systemd/user/sockets.target.wants/gpg-agent-ssh.socket → /usr/lib/systemd/user/gpg-agent-ssh.socket.
#15 225.9 Created symlink /etc/systemd/user/sockets.target.wants/gpg-agent.socket → /usr/lib/systemd/user/gpg-agent.socket.
#15 226.0 Setting up libpdfbox-java (1:1.8.16-2) ...
#15 226.0 Setting up libavif15:amd64 (0.11.1-1) ...
#15 226.1 Setting up libmbedx509-1:amd64 (2.28.3-1) ...
#15 226.2 Setting up libmbedtls14:amd64 (2.28.3-1) ...
#15 226.2 Setting up nettle-dev:amd64 (3.8.1-2) ...
#15 226.3 Setting up libcsv-dev:amd64 (3.0.3+dfsg-6) ...
#15 226.3 Setting up libopts25-dev:amd64 (1:5.18.16-5) ...
#15 226.4 Setting up guile-3.0-libs:amd64 (3.0.8-2) ...
#15 226.4 Setting up libarchive13:amd64 (3.6.2-1+deb12u2) ...
#15 226.5 Setting up libxcb-render0:amd64 (1.15-1) ...
#15 226.6 Setting up fontconfig-config (2.14.1-4) ...
#15 226.7 debconf: unable to initialize frontend: Dialog
#15 226.7 debconf: (TERM is not set, so the dialog frontend is not usable.)
#15 226.7 debconf: falling back to frontend: Readline
#15 226.7 debconf: unable to initialize frontend: Readline
#15 226.7 debconf: (This frontend requires a controlling tty.)
#15 226.7 debconf: falling back to frontend: Teletype
#15 226.9 Setting up libdbd-sqlite3:amd64 (0.9.0-11) ...
#15 227.0 Setting up libbctoolbox1:amd64 (5.1.64-2) ...
#15 227.0 Setting up libboost-coroutine1.74.0:amd64 (1.74.0+ds1-21) ...
#15 227.1 Setting up libwebpdemux2:amd64 (1.2.4-0.2+deb12u1) ...
#15 227.2 Setting up gcc-arm-none-eabi (15:12.2.rel1-1) ...
#15 227.2 Setting up libedit2:amd64 (3.1-20221030-2) ...
#15 227.3 Setting up gpgsm (2.2.40-1.1) ...
#15 227.3 Setting up ccache (4.8+really4.7.5-1) ...
#15 227.4 Updating symlinks in /usr/lib/ccache ...
#15 227.4 Setting up libcommons-parent-java (56-1) ...
#15 227.5 Setting up libavahi-common3:amd64 (0.8-10+deb12u1) ...
#15 227.5 Setting up inetutils-telnet (2:2.4-2+deb12u1) ...
#15 227.6 update-alternatives: using /usr/bin/inetutils-telnet to provide /usr/bin/telnet (telnet) in auto mode
#15 227.6 update-alternatives: warning: skip creation of /usr/share/man/man1/telnet.1.gz because associated file /usr/share/man/man1/inetutils-telnet.1.gz (of link group telnet) doesn't exist
#15 227.6 Setting up libfindlib-ocaml (1.9.6-1+b1) ...
#15 227.7 Setting up libcommons-logging-java (1.2-3) ...
#15 227.7 Setting up libevent-openssl-2.1-7:amd64 (2.1.12-stable-8) ...
#15 228.0 Setting up libglib2.0-bin (2.74.6-2+deb12u5) ...
#15 228.1 Setting up libfftw3-long3:amd64 (3.3.10-1) ...
#15 228.1 Setting up libusb-1.0-0-dev:amd64 (2:1.0.26-1) ...
#15 228.2 Setting up libboost-tools-dev (1.74.0.3) ...
#15 228.2 Setting up libnftnl11:amd64 (1.2.4-2) ...
#15 228.3 Setting up libxcb-shm0:amd64 (1.15-1) ...
#15 228.3 Setting up dbus-daemon (1.14.10-1~deb12u1) ...
#15 228.4 Setting up libcdk5nc6:amd64 (5.0.20180306-3) ...
#15 228.5 Setting up opensp (1.5.2-13+b2) ...
#15 228.5 Setting up libaio-dev:amd64 (0.3.113-4) ...
#15 228.6 Setting up libboost-nowide-dev (1.74.0.3) ...
#15 228.7 Setting up libbladerf2:amd64 (0.2022.11-1) ...
#15 228.7 Setting up libldap-2.5-0:amd64 (2.5.13+dfsg-5) ...
#15 228.8 Setting up sdcc (4.2.0+dfsg-1) ...
#15 228.9 Setting up pkgconf:amd64 (1.8.1-1) ...
#15 228.9 Setting up libnl-route-3-200:amd64 (3.7.0-0.2+b1) ...
#15 229.0 Setting up dirmngr (2.2.40-1.1) ...
#15 229.1 Created symlink /etc/systemd/user/sockets.target.wants/dirmngr.socket → /usr/lib/systemd/user/dirmngr.socket.
#15 229.1 Setting up libtalloc-dev:amd64 (2.4.0-f2) ...
#15 229.1 Setting up libthai0:amd64 (0.1.29-1) ...
#15 229.2 Setting up libgprofng0:amd64 (2.40-2) ...
#15 229.3 Setting up libunbound8:amd64 (1.17.1-2+deb12u2) ...
#15 229.3 Setting up libjs-jquery-ui (1.13.2+dfsg-1) ...
#15 229.4 Setting up libptexenc1:amd64 (2022.20220321.62855-5.1+deb12u2) ...
#15 229.4 Setting up libfreetype6:amd64 (2.12.1+dfsg-5+deb12u4) ...
#15 229.5 Setting up libpcap0.8:amd64 (1.10.3-1) ...
#15 229.6 Setting up libmnl-dev:amd64 (1.0.4-3) ...
#15 229.6 Setting up dbus (1.14.10-1~deb12u1) ...
#15 229.7 invoke-rc.d: could not determine current runlevel
#15 229.7 invoke-rc.d: policy-rc.d denied execution of start.
#15 229.8 Setting up libfftw3-quad3:amd64 (3.3.10-1) ...
#15 229.8 Setting up libgcc-12-dev:amd64 (12.2.0-14) ...
#15 229.9 Setting up shared-mime-info (2.2-1) ...
#15 239.0 Setting up ofono (1.31-3+b1) ...
#15 239.2 invoke-rc.d: could not determine current runlevel
#15 239.2 invoke-rc.d: policy-rc.d denied execution of start.
#15 239.2 invoke-rc.d: could not determine current runlevel
#15 239.2 invoke-rc.d: policy-rc.d denied execution of start.
#15 239.3 Created symlink /etc/systemd/system/multi-user.target.wants/dundee.service → /lib/systemd/system/dundee.service.
#15 239.4 Created symlink /etc/systemd/system/multi-user.target.wants/ofono.service → /lib/systemd/system/ofono.service.
#15 239.4 Setting up ocaml-findlib (1.9.6-1+b1) ...
#15 239.5 Setting up libevent-dev (2.1.12-stable-8) ...
#15 239.5 Setting up libnftnl-dev:amd64 (1.2.4-2) ...
#15 239.6 Setting up libgssapi-krb5-2:amd64 (1.20.1-2+deb12u2) ...
#15 239.6 Setting up libortp16:amd64 (1:5.1.64-2) ...
#15 239.7 Setting up libsystemd-shared:amd64 (252.36-1~deb12u1) ...
#15 239.7 Setting up libboost-numpy1.74-dev (1.74.0+ds1-21) ...
#15 239.8 Setting up pkg-config:amd64 (1.8.1-1) ...
#15 239.9 Setting up libgdbm-compat4:amd64 (1.23-3) ...
#15 239.9 Setting up libbctoolbox-dev:amd64 (5.1.64-2) ...
#15 240.0 Setting up ucf (3.0043+nmu1+deb12u1) ...
#15 240.1 debconf: unable to initialize frontend: Dialog
#15 240.1 debconf: (TERM is not set, so the dialog frontend is not usable.)
#15 240.1 debconf: falling back to frontend: Readline
#15 240.1 debconf: unable to initialize frontend: Readline
#15 240.1 debconf: (This frontend requires a controlling tty.)
#15 240.1 debconf: falling back to frontend: Teletype
#15 240.1 Setting up gir1.2-glib-2.0:amd64 (1.74.0-3) ...
#15 240.2 Setting up libjs-sphinxdoc (5.3.0-4) ...
#15 240.2 Setting up libx265-199:amd64 (3.5-2+b1) ...
#15 240.3 Setting up libsofia-sip-ua-dev (1.12.11+20110422.1+1e14eea~dfsg-6) ...
#15 240.4 Setting up gpg-wks-server (2.2.40-1.1) ...
#15 240.4 Setting up libllvm14:amd64 (1:14.0.6-12) ...
#15 240.5 Setting up libboost-wave1.74.0:amd64 (1.74.0+ds1-21) ...
#15 240.5 Setting up libgvpr2:amd64 (2.42.2-7+deb12u1) ...
#15 240.6 Setting up dwz (0.15-1) ...
#15 240.6 Setting up libnl-3-dev:amd64 (3.7.0-0.2+b1) ...
#15 240.7 Setting up groff-base (1.22.4-10) ...
#15 240.8 Setting up cpp (4:12.2.0-3) ...
#15 240.8 Setting up xml-core (0.18+nmu1) ...
#15 241.0 Setting up source-highlight (3.1.9-4.2+b3) ...
#15 241.1 Setting up libnl-genl-3-200:amd64 (3.7.0-0.2+b1) ...
#15 241.2 Setting up libxslt1.1:amd64 (1.1.35-1+deb12u1) ...
#15 241.2 Setting up libcurl4:amd64 (7.88.1-10+deb12u12) ...
#15 241.3 Setting up libx11-6:amd64 (2:1.8.4-2+deb12u2) ...
#15 241.4 Setting up libharfbuzz0b:amd64 (6.0.0+dfsg-3) ...
#15 241.4 Setting up libgdk-pixbuf-2.0-0:amd64 (2.42.10+dfsg-1+deb12u1) ...
#15 241.5 Setting up curl (7.88.1-10+deb12u12) ...
#15 241.5 Setting up libfontconfig1:amd64 (2.14.1-4) ...
#15 241.6 Setting up lynx (2.9.0dev.12-1) ...
#15 241.6 update-alternatives: using /usr/bin/lynx to provide /usr/bin/www-browser (www-browser) in auto mode
#15 241.6 update-alternatives: warning: skip creation of /usr/share/man/man1/www-browser.1.gz because associated file /usr/share/man/man1/lynx.1.gz (of link group www-browser) doesn't exist
#15 241.7 Setting up picolibc-arm-none-eabi (1.8-1) ...
#15 241.7 Setting up libxml2-utils (2.9.14+dfsg-1.3~deb12u1) ...
#15 241.8 Setting up libboost-locale1.74.0:amd64 (1.74.0+ds1-21) ...
#15 241.8 Setting up libsm6:amd64 (2:1.2.3-1) ...
#15 241.9 Setting up libgps-dev:amd64 (3.22-4.1+b1) ...
#15 241.9 Setting up libavahi-client3:amd64 (0.8-10+deb12u1) ...
#15 242.0 Setting up libperl5.36:amd64 (5.36.0-7+deb12u1) ...
#15 242.1 Setting up libortp-dev:amd64 (1:5.1.64-2) ...
#15 242.1 Setting up rsync (3.2.7-1+deb12u2) ...
#15 242.2 invoke-rc.d: could not determine current runlevel
#15 242.2 invoke-rc.d: policy-rc.d denied execution of start.
#15 242.3 Setting up libboost-type-erasure1.74.0:amd64 (1.74.0+ds1-21) ...
#15 242.3 Setting up binutils-x86-64-linux-gnu (2.40-2) ...
#15 242.4 Setting up libtirpc3:amd64 (1.3.3+ds-1) ...
#15 242.4 Setting up libpaper1:amd64 (1.1.29) ...
#15 242.5 debconf: unable to initialize frontend: Dialog
#15 242.5 debconf: (TERM is not set, so the dialog frontend is not usable.)
#15 242.5 debconf: falling back to frontend: Readline
#15 242.5 debconf: unable to initialize frontend: Readline
#15 242.5 debconf: (This frontend requires a controlling tty.)
#15 242.5 debconf: falling back to frontend: Teletype
#15 242.5
#15 242.5 Creating config file /etc/papersize with new version
#15 242.6 Setting up tcpdump (4.99.3-1) ...
#15 242.9 Setting up libibverbs1:amd64 (44.0-2) ...
#15 243.0 Setting up fontconfig (2.14.1-4) ...
#15 243.1 Regenerating fonts cache... done.
#15 245.5 Setting up libgnutls-dane0:amd64 (3.7.9-2+deb12u4) ...
#15 245.6 Setting up libnftables1:amd64 (1.0.6-2+deb12u2) ...
#15 245.6 Setting up telnet (0.17+2.4-2+deb12u1) ...
#15 245.7 Setting up libzmq5:amd64 (4.3.4-6) ...
#15 245.7 Setting up libxpm4:amd64 (1:3.5.12-1.1+deb12u1) ...
#15 245.8 Setting up gpg-wks-client (2.2.40-1.1) ...
#15 245.8 Setting up libxrender1:amd64 (1:0.9.10-1.1) ...
#15 245.9 Setting up ibverbs-providers:amd64 (44.0-2) ...
#15 246.3 Setting up libnftables-dev:amd64 (1.0.6-2+deb12u2) ...
#15 246.4 Setting up libsombok3:amd64 (2.4.0-2+b1) ...
#15 246.4 Setting up libfftw3-bin (3.3.10-1) ...
#15 246.5 Setting up htop (3.2.2-2) ...
#15 246.5 Setting up iproute2 (6.1.0-3) ...
#15 246.8 debconf: unable to initialize frontend: Dialog
#15 246.8 debconf: (TERM is not set, so the dialog frontend is not usable.)
#15 246.8 debconf: falling back to frontend: Readline
#15 246.8 debconf: unable to initialize frontend: Readline
#15 246.8 debconf: (This frontend requires a controlling tty.)
#15 246.8 debconf: falling back to frontend: Teletype
#15 246.9 Setting up openssh-client (1:9.2p1-2+deb12u5) ...
#15 247.0 Setting up libpango-1.0-0:amd64 (1.50.12+ds-1) ...
#15 247.1 Setting up libheif1:amd64 (1.15.1-1+deb12u1) ...
#15 247.2 Setting up xsltproc (1.1.35-1+deb12u1) ...
#15 247.2 Setting up libxext6:amd64 (2:1.3.4-1+b1) ...
#15 247.3 Setting up libclang1-14 (1:14.0.6-12) ...
#15 247.3 Setting up libcurl3-gnutls:amd64 (7.88.1-10+deb12u12) ...
#15 247.4 Setting up libgfortran-12-dev:amd64 (12.2.0-14) ...
#15 247.4 Setting up binutils (2.40-2) ...
#15 247.5 Setting up libpaper-utils (1.1.29) ...
#15 247.5 Setting up xfonts-utils (1:7.7+6) ...
#15 247.6 Setting up man-db (2.11.2-2) ...
#15 247.8 debconf: unable to initialize frontend: Dialog
#15 247.8 debconf: (TERM is not set, so the dialog frontend is not usable.)
#15 247.8 debconf: falling back to frontend: Readline
#15 247.8 debconf: unable to initialize frontend: Readline
#15 247.8 debconf: (This frontend requires a controlling tty.)
#15 247.8 debconf: falling back to frontend: Teletype
#15 247.8 Building database of manual pages ...
#15 247.8 Created symlink /etc/systemd/system/timers.target.wants/man-db.timer → /lib/systemd/system/man-db.timer.
#15 247.9 Setting up libcairo2:amd64 (1.16.0-7) ...
#15 248.0 Setting up libxnvctrl0:amd64 (525.85.05-3~deb12u1) ...
#15 248.0 Setting up tex-common (6.18) ...
#15 248.1 debconf: unable to initialize frontend: Dialog
#15 248.1 debconf: (TERM is not set, so the dialog frontend is not usable.)
#15 248.1 debconf: falling back to frontend: Readline
#15 248.1 debconf: unable to initialize frontend: Readline
#15 248.1 debconf: (This frontend requires a controlling tty.)
#15 248.1 debconf: falling back to frontend: Teletype
#15 248.2 update-language: texlive-base not installed and configured, doing nothing!
#15 248.3 Setting up libnl-route-3-dev:amd64 (3.7.0-0.2+b1) ...
#15 248.3 Setting up libgssrpc4:amd64 (1.20.1-2+deb12u2) ...
#15 248.4 Setting up perl (5.36.0-7+deb12u1) ...
#15 248.5 Setting up libtirpc-dev:amd64 (1.3.3+ds-1) ...
#15 248.6 Setting up gcc-12 (12.2.0-14) ...
#15 248.6 Setting up libraqm0:amd64 (0.7.0-4.1) ...
#15 248.7 Setting up libboost-numpy-dev (1.74.0.3) ...
#15 248.7 Setting up libgd3:amd64 (2.3.3-9) ...
#15 248.8 Setting up stow (2.3.1-1) ...
#15 248.8 Setting up libio-html-perl (1.004-3) ...
#15 248.9 Setting up libb-hooks-op-check-perl:amd64 (0.22-2+b1) ...
#15 248.9 Setting up libclang-cpp14 (1:14.0.6-12) ...
#15 249.0 Setting up libxt6:amd64 (1:1.2.1-1.1) ...
#15 249.1 Setting up libdpkg-perl (1.21.22) ...
#15 249.1 Setting up autoconf (2.71-3) ...
#15 249.2 Setting up libtimedate-perl (2.3300-2) ...
#15 249.2 Setting up libregexp-ipv6-perl (0.03-3) ...
#15 249.3 Setting up module-assistant (0.11.11) ...
#15 249.4 Setting up libcups2:amd64 (2.4.2-3+deb12u8) ...
#15 249.5 Setting up libmime-charset-perl (1.013.1-2) ...
#15 249.5 Setting up lmodern (2.005-1) ...
#15 249.7 Setting up libjson-perl (4.10000-1) ...
#15 249.8 Setting up libnsl2:amd64 (1.3.0-2) ...
#15 249.8 Setting up gnupg (2.2.40-1.1) ...
#15 249.9 Setting up cmake (3.25.1-1) ...
#15 250.0 Setting up libsub-override-perl (0.09-4) ...
#15 250.0 Setting up libsub-quote-perl (2.006008-1) ...
#15 250.1 Setting up libclass-xsaccessor-perl (1.19-4+b1) ...
#15 250.1 Setting up libcairo-gobject2:amd64 (1.16.0-7) ...
#15 250.2 Setting up libpangoft2-1.0-0:amd64 (1.50.12+ds-1) ...
#15 250.2 Setting up libfile-dirlist-perl (0.05-3) ...
#15 250.3 Setting up libtext-unidecode-perl (1.30-3) ...
#15 250.3 Setting up libperlio-gzip-perl (0.20-1+b1) ...
#15 250.4 Setting up mailcap (3.70+nmu1) ...
#15 250.5 Setting up libfftw3-dev:amd64 (3.3.10-1) ...
#15 250.6 Setting up tex-gyre (20180621-6) ...
#15 250.8 Setting up liburi-perl (5.17-1) ...
#15 250.9 Setting up libfile-touch-perl (0.12-2) ...
#15 250.9 Setting up libpangocairo-1.0-0:amd64 (1.50.12+ds-1) ...
#15 251.0 Setting up libkadm5clnt-mit12:amd64 (1.20.1-2+deb12u2) ...
#15 251.0 Setting up libnet-ssleay-perl:amd64 (1.92-2+b1) ...
#15 251.1 Setting up automake (1:1.16.5-1.3) ...
#15 251.1 update-alternatives: using /usr/bin/automake-1.16 to provide /usr/bin/automake (automake) in auto mode
#15 251.1 update-alternatives: warning: skip creation of /usr/share/man/man1/automake.1.gz because associated file /usr/share/man/man1/automake-1.16.1.gz (of link group automake) doesn't exist
#15 251.1 update-alternatives: warning: skip creation of /usr/share/man/man1/aclocal.1.gz because associated file /usr/share/man/man1/aclocal-1.16.1.gz (of link group automake) doesn't exist
#15 251.1 Setting up librdmacm1:amd64 (44.0-2) ...
#15 251.2 Setting up libhttp-date-perl (6.05-2) ...
#15 251.2 Setting up libfile-which-perl (1.27-2) ...
#15 251.3 Setting up libucx0:amd64 (1.13.1-1) ...
#15 251.4 Setting up libsgmls-perl (1.03ii-38) ...
#15 251.4 Setting up libxmu6:amd64 (2:1.1.3-3) ...
#15 251.5 Setting up libkdb5-10:amd64 (1.20.1-2+deb12u2) ...
#15 251.5 Setting up libfile-listing-perl (6.15-1) ...
#15 251.6 Setting up mime-support (3.66) ...
#15 251.6 Setting up libxi6:amd64 (2:1.8-1+b1) ...
#15 251.7 Setting up libdynaloader-functions-perl (0.003-3) ...
#15 251.7 Setting up libclass-method-modifiers-perl (2.14-1) ...
#15 251.8 Setting up libio-pty-perl (1:1.17-1) ...
#15 251.8 Setting up sgmlspl (1.03ii-38) ...
#15 251.9 Setting up mscgen (0.20-14) ...
#15 251.9 Setting up libclone-perl:amd64 (0.46-1) ...
#15 252.0 Setting up libarchive-zip-perl (1.68-1) ...
#15 252.0 Setting up libhtml-tagset-perl (3.20-6) ...
#15 252.1 Setting up preview-latex-style (12.2-1) ...
#15 252.2 Setting up libpython3.11-stdlib:amd64 (3.11.2-6+deb12u5) ...
#15 252.2 Setting up libdebhelper-perl (13.11.4) ...
#15 252.3 Setting up liblwp-mediatypes-perl (6.04-2) ...
#15 252.3 Setting up libtry-tiny-perl (0.31-2) ...
#15 252.4 Setting up libxml-namespacesupport-perl (1.12-2) ...
#15 252.4 Setting up libnet-http-perl (6.22-1) ...
#15 252.5 Setting up libencode-locale-perl (1.05-3) ...
#15 252.5 Setting up libxaw7:amd64 (2:1.0.14-1) ...
#15 252.6 Setting up fonts-urw-base35 (20200910-7) ...
#15 252.8 Setting up libibverbs-dev:amd64 (44.0-2) ...
#15 252.9 Setting up libhwloc-plugins:amd64 (2.9.0-1) ...
#15 252.9 Setting up libdevel-callchecker-perl:amd64 (0.008-2) ...
#15 253.0 Setting up gcc (4:12.2.0-3) ...
#15 253.1 Setting up autogen (1:5.18.16-5) ...
#15 253.1 Setting up dpkg-dev (1.21.22) ...
#15 253.2 Setting up intltool-debian (0.35.0+20060710.6) ...
#15 253.3 Setting up librsvg2-2:amd64 (2.54.7+dfsg-1~deb12u1) ...
#15 253.3 Setting up liberror-perl (0.17029-2) ...
#15 253.4 Setting up patchutils (0.4.2-1) ...
#15 253.4 Setting up libltdl-dev:amd64 (2.4.7-7~deb12u1) ...
#15 253.5 Setting up libxml-sax-base-perl (1.09-3) ...
#15 253.5 Setting up doxygen (1.9.4-4) ...
#15 253.6 Setting up libwrap0:amd64 (7.6.q-32) ...
#15 253.7 Setting up libunicode-linebreak-perl (0.0.20190101-1+b5) ...
#15 253.7 Setting up libgvc6 (2.42.2-7+deb12u1) ...
#15 253.8 Setting up libipc-run-perl (20220807.0-1) ...
#15 253.8 Setting up git (1:2.39.5-0+deb12u2) ...
#15 253.9 Setting up libwww-robotrules-perl (6.02-1) ...
#15 254.0 Setting up libnsl-dev:amd64 (1.3.0-2) ...
#15 254.0 Setting up texlive-binaries (2022.20220321.62855-5.1+deb12u2) ...
#15 254.1 update-alternatives: using /usr/bin/xdvi-xaw to provide /usr/bin/xdvi.bin (xdvi.bin) in auto mode
#15 254.1 update-alternatives: using /usr/bin/bibtex.original to provide /usr/bin/bibtex (bibtex) in auto mode
#15 254.1 update-alternatives: warning: skip creation of /usr/share/man/man1/bibtex.1.gz because associated file /usr/share/man/man1/bibtex.original.1.gz (of link group bibtex) doesn't exist
#15 254.1 Setting up libwrap0-dev:amd64 (7.6.q-32) ...
#15 254.2 Setting up libhtml-parser-perl:amd64 (3.81-1) ...
#15 254.2 Setting up libkadm5srv-mit12:amd64 (1.20.1-2+deb12u2) ...
#15 254.3 Setting up librole-tiny-perl (2.002004-1) ...
#15 254.4 Setting up libc6-dev:amd64 (2.36-9+deb12u10) ...
#15 254.4 Setting up libfile-homedir-perl (1.006-2) ...
#15 254.5 Setting up texlive-base (2022.20230122-3) ...
#15 255.2 tl-paper: setting paper size for dvips to a4: /var/lib/texmf/dvips/config/config-paper.ps
#15 255.3 tl-paper: setting paper size for dvipdfmx to a4: /var/lib/texmf/dvipdfmx/dvipdfmx-paper.cfg
#15 255.5 tl-paper: setting paper size for xdvi to a4: /var/lib/texmf/xdvi/XDvi-paper
#15 255.6 tl-paper: setting paper size for pdftex to a4: /var/lib/texmf/tex/generic/tex-ini-files/pdftexconfig.tex
#15 255.7 debconf: unable to initialize frontend: Dialog
#15 255.7 debconf: (TERM is not set, so the dialog frontend is not usable.)
#15 255.7 debconf: falling back to frontend: Readline
#15 255.7 debconf: unable to initialize frontend: Readline
#15 255.7 debconf: (This frontend requires a controlling tty.)
#15 255.7 debconf: falling back to frontend: Teletype
#15 256.0 Setting up libicu-dev:amd64 (72.1-3) ...
#15 256.0 Setting up libio-socket-ssl-perl (2.081-2) ...
#15 256.1 Setting up liburing-dev:amd64 (2.3-3) ...
#15 256.1 Setting up libpython3-stdlib:amd64 (3.11.2-1+b1) ...
#15 256.2 Setting up libhttp-message-perl (6.44-1) ...
#15 256.2 Setting up libgnutls28-dev:amd64 (3.7.9-2+deb12u4) ...
#15 256.3 Setting up libfile-stripnondeterminism-perl (1.13.1-1) ...
#15 256.3 Setting up graphviz (2.42.2-7+deb12u1) ...
#15 256.4 Setting up libfabric1:amd64 (1.17.0-3) ...
#15 256.5 Setting up libgs10-common (10.0.0~dfsg-11+deb12u7) ...
#15 256.5 Setting up librsvg2-bin (2.54.7+dfsg-1~deb12u1) ...
#15 256.6 Setting up python3.11 (3.11.2-6+deb12u5) ...
#15 257.0 Setting up libhttp-negotiate-perl (6.01-2) ...
#15 257.0 Setting up libncurses-dev:amd64 (6.4-4) ...
#15 257.1 Setting up libbladerf-dev:amd64 (0.2022.11-1) ...
#15 257.1 Setting up libpython3.11:amd64 (3.11.2-6+deb12u5) ...
#15 257.2 Setting up libpcre2-dev:amd64 (10.42-1) ...
#15 257.2 Setting up libpmix2:amd64 (4.2.2-1+deb12u1) ...
#15 257.3 Setting up libstdc++-12-dev:amd64 (12.2.0-14) ...
#15 257.3 Setting up libhttp-cookies-perl (6.10-1) ...
#15 257.4 Setting up libtool (2.4.7-7~deb12u1) ...
#15 257.5 Setting up texlive-luatex (2022.20230122-3) ...
#15 257.5 Setting up libselinux1-dev:amd64 (3.4-1+b6) ...
#15 257.6 Setting up po-debconf (1.0.21+nmu1) ...
#15 257.6 Setting up libhtml-tree-perl (5.07-3) ...
#15 257.7 Setting up libopenmpi3:amd64 (4.1.4-3+b1) ...
#15 257.7 Setting up libparams-classify-perl:amd64 (0.015-2+b1) ...
#15 257.8 Setting up libboost-mpi1.74.0 (1.74.0+ds1-21) ...
#15 257.8 Setting up texlive-plain-generic (2022.20230122-4) ...
#15 257.9 Setting up lcov (1.16-1) ...
#15 258.0 Setting up python3 (3.11.2-1+b1) ...
#15 258.0 running python rtupdate hooks for python3.11...
#15 258.2 running python post-rtupdate hooks for python3.11...
#15 258.3 Setting up texlive-lang-greek (2022.20230122-1) ...
#15 258.4 Setting up libusb-dev (2:0.1.12-32) ...
#15 258.5 Setting up libreadline-dev:amd64 (8.2-1.3) ...
#15 258.5 Setting up python3-distlib (0.3.6-1) ...
#15 258.7 Setting up python3-markupsafe (2.1.2-1+b1) ...
#15 258.8 Setting up libxml-sax-perl (1.02+dfsg-3) ...
#15 258.9 update-perl-sax-parsers: Registering Perl SAX parser XML::SAX::PurePerl with priority 10...
#15 258.9 update-perl-sax-parsers: Updating overall Perl SAX parser modules info file...
#15 259.0 debconf: unable to initialize frontend: Dialog
#15 259.0 debconf: (TERM is not set, so the dialog frontend is not usable.)
#15 259.0 debconf: falling back to frontend: Readline
#15 259.0 debconf: unable to initialize frontend: Readline
#15 259.0 debconf: (This frontend requires a controlling tty.)
#15 259.0 debconf: falling back to frontend: Teletype
#15 259.0
#15 259.0 Creating config file /etc/perl/XML/SAX/ParserDetails.ini with new version
#15 259.1 Setting up python3-platformdirs (2.6.0-1) ...
#15 259.2 Setting up libcdk5-dev (5.0.20180306-3) ...
#15 259.3 Setting up libnuma-dev:amd64 (2.0.16-1) ...
#15 259.3 Setting up python3-six (1.16.0-4) ...
#15 259.5 Setting up dh-autoreconf (20) ...
#15 259.5 Setting up asciidoc-common (10.2.0-1) ...
#15 260.6 Setting up python3-pil:amd64 (9.4.0-1.1+deb12u1) ...
#15 260.8 Setting up python3-roman (3.3-3) ...
#15 260.9 Setting up gfortran-12 (12.2.0-14) ...
#15 261.0 Setting up libxml2-dev:amd64 (2.9.14+dfsg-1.3~deb12u1) ...
#15 261.1 Setting up libsnmp40:amd64 (5.9.3+dfsg-2) ...
#15 261.1 Setting up python3-webcolors (1.11.1-1) ...
#15 261.2 Setting up libexpat1-dev:amd64 (2.5.0-1+deb12u1) ...
#15 261.3 Setting up libsqlite3-dev:amd64 (3.40.1-2+deb12u1) ...
#15 261.3 Setting up texlive-latex-base (2022.20230122-3) ...
#15 261.4 Setting up libmodule-runtime-perl (0.016-2) ...
#15 261.5 Setting up texlive-extra-utils (2022.20230122-4) ...
#15 261.6 Setting up uuid-dev:amd64 (2.38.1-5+deb12u3) ...
#15 261.6 Setting up python3-dill (0.3.6-1) ...
#15 261.8 Setting up python3-gi (3.42.2-3+b1) ...
#15 261.9 Setting up texlive-latex-recommended (2022.20230122-3) ...
#15 262.0 Setting up python3-reportlab-accel:amd64 (3.6.12-1+deb12u1) ...
#15 262.0 Setting up comerr-dev:amd64 (2.1-1.47.0-2) ...
#15 262.1 Setting up python3-wrapt (1.14.1-2+b2) ...
#15 262.2 Setting up libsctp-dev:amd64 (1.0.19+dfsg-2) ...
#15 262.2 Setting up python3-funcparserlib (1.0.0-0.2) ...
#15 262.4 Setting up python3-typing-extensions (4.4.0-1) ...
#15 262.5 Setting up python3-toml (0.10.2-1) ...
#15 262.6 Setting up texlive-pictures (2022.20230122-3) ...
#15 262.7 Setting up python3-isort (5.6.4-1) ...
#15 262.9 Setting up python3-reportlab (3.6.12-1+deb12u1) ...
#15 263.2 Setting up libxml-libxml-perl (2.0207+dfsg+really+2.0134-1+b1) ...
#15 263.3 update-perl-sax-parsers: Registering Perl SAX parser XML::LibXML::SAX::Parser with priority 50...
#15 263.3 update-perl-sax-parsers: Registering Perl SAX parser XML::LibXML::SAX with priority 50...
#15 263.4 update-perl-sax-parsers: Updating overall Perl SAX parser modules info file...
#15 263.4 debconf: unable to initialize frontend: Dialog
#15 263.4 debconf: (TERM is not set, so the dialog frontend is not usable.)
#15 263.4 debconf: falling back to frontend: Readline
#15 263.4 debconf: unable to initialize frontend: Readline
#15 263.4 debconf: (This frontend requires a controlling tty.)
#15 263.4 debconf: falling back to frontend: Teletype
#15 263.4 Replacing config file /etc/perl/XML/SAX/ParserDetails.ini with new version
#15 263.5 Setting up libnetsnmptrapd40:amd64 (5.9.3+dfsg-2) ...
#15 263.6 Setting up dh-strip-nondeterminism (1.13.1-1) ...
#15 263.6 Setting up zlib1g-dev:amd64 (1:1.2.13.dfsg-1) ...
#15 263.7 Setting up libncurses5-dev:amd64 (6.4-4) ...
#15 263.7 Setting up texlive-fonts-recommended (2022.20230122-3) ...
#15 263.8 Setting up python3-mccabe (0.7.0-1) ...
#15 263.9 Setting up libhwloc-dev:amd64 (2.9.0-1) ...
#15 264.0 Setting up tipa (2:1.3-21) ...
#15 264.1 Setting up python3-lazy-object-proxy (1.9.0-1+b1) ...
#15 264.2 Setting up libboost-graph-parallel1.74.0 (1.74.0+ds1-21) ...
#15 264.2 Setting up clang-format-14 (1:14.0.6-12) ...
#15 264.3 Setting up python3-tomlkit (0.11.7-1) ...
#15 264.4 Setting up python3-lib2to3 (3.11.2-3) ...
#15 264.5 Setting up libpmix-dev:amd64 (4.2.2-1+deb12u1) ...
#15 264.6 Setting up openmpi-bin (4.1.4-3+b1) ...
#15 264.7 update-alternatives: using /usr/bin/mpirun.openmpi to provide /usr/bin/mpirun (mpirun) in auto mode
#15 264.7 update-alternatives: warning: skip creation of /usr/share/man/man1/mpirun.1.gz because associated file /usr/share/man/man1/mpirun.openmpi.1.gz (of link group mpirun) doesn't exist
#15 264.7 update-alternatives: warning: skip creation of /usr/share/man/man1/mpiexec.1.gz because associated file /usr/share/man/man1/mpiexec.openmpi.1.gz (of link group mpirun) doesn't exist
#15 264.7 update-alternatives: using /usr/bin/mpicc.openmpi to provide /usr/bin/mpicc (mpi) in auto mode
#15 264.7 update-alternatives: warning: skip creation of /usr/share/man/man1/mpicc.1.gz because associated file /usr/share/man/man1/mpicc.openmpi.1.gz (of link group mpi) doesn't exist
#15 264.7 update-alternatives: warning: skip creation of /usr/share/man/man1/mpic++.1.gz because associated file /usr/share/man/man1/mpic++.openmpi.1.gz (of link group mpi) doesn't exist
#15 264.7 update-alternatives: warning: skip creation of /usr/share/man/man1/mpicxx.1.gz because associated file /usr/share/man/man1/mpicxx.openmpi.1.gz (of link group mpi) doesn't exist
#15 264.7 update-alternatives: warning: skip creation of /usr/share/man/man1/mpiCC.1.gz because associated file /usr/share/man/man1/mpiCC.openmpi.1.gz (of link group mpi) doesn't exist
#15 264.7 update-alternatives: warning: skip creation of /usr/share/man/man1/mpif77.1.gz because associated file /usr/share/man/man1/mpif77.openmpi.1.gz (of link group mpi) doesn't exist
#15 264.7 update-alternatives: warning: skip creation of /usr/share/man/man1/mpif90.1.gz because associated file /usr/share/man/man1/mpif90.openmpi.1.gz (of link group mpi) doesn't exist
#15 264.7 update-alternatives: warning: skip creation of /usr/share/man/man1/mpifort.1.gz because associated file /usr/share/man/man1/mpifort.openmpi.1.gz (of link group mpi) doesn't exist
#15 264.7 Setting up libpci-dev:amd64 (1:3.9.0-4) ...
#15 264.8 Setting up coccinelle (1.1.1.deb-2+b1) ...
#15 264.9 Setting up g++-12 (12.2.0-14) ...
#15 265.0 Setting up krb5-multidev:amd64 (1.20.1-2+deb12u2) ...
#15 265.0 Setting up libgs10:amd64 (10.0.0~dfsg-11+deb12u7) ...
#15 265.1 Setting up python3-pkg-resources (66.1.1-1+deb12u1) ...
#15 265.3 Setting up python3-distutils (3.11.2-3) ...
#15 265.4 Setting up python3-more-itertools (8.10.0-2) ...
#15 265.6 Setting up libglib2.0-dev-bin (2.74.6-2+deb12u5) ...
#15 265.7 Setting up libblkid-dev:amd64 (2.38.1-5+deb12u3) ...
#15 265.7 Setting up clang-format:amd64 (1:14.0-55.7~deb12u1) ...
#15 265.8 Setting up python3-filelock (3.9.0-1) ...
#15 265.9 Setting up liblua5.3-dev:amd64 (5.3.6-2) ...
#15 266.0 Setting up libboost1.74-dev:amd64 (1.74.0+ds1-21) ...
#15 266.0 Setting up python3-setuptools (66.1.1-1+deb12u1) ...
#15 266.3 Setting up libboost-container1.74-dev:amd64 (1.74.0+ds1-21) ...
#15 266.4 Setting up texlive (2022.20230122-3) ...
#15 266.4 Setting up python3-apt (2.6.0) ...
#15 266.6 Setting up libimport-into-perl (1.002005-2) ...
#15 266.6 Setting up python3-usb (1.2.1-2) ...
#15 266.8 Setting up python3-mypy-extensions (0.4.3-4) ...
#15 266.9 Setting up libmoo-perl (2.005005-1) ...
#15 266.9 Setting up libboost-chrono1.74-dev:amd64 (1.74.0+ds1-21) ...
#15 267.0 Setting up python3-pyflakes (2.5.0-1) ...
#15 267.1 Setting up texlive-science (2022.20230122-4) ...
#15 267.2 Setting up mpi-default-bin (1.14) ...
#15 267.3 Setting up libnorm-dev:amd64 (1.5.9+dfsg-2) ...
#15 267.3 Setting up python3-virtualenv (20.17.1+ds-1) ...
#15 267.5 Setting up latexmk (1:4.79-1) ...
#15 267.6 Setting up python3-yaml (6.0-3+b2) ...
#15 267.7 Setting up debhelper (13.11.4) ...
#15 267.8 Setting up texlive-latex-extra (2022.20230122-4) ...
#15 267.9 Setting up libboost-exception1.74-dev:amd64 (1.74.0+ds1-21) ...
#15 267.9 Setting up libboost-exception-dev:amd64 (1.74.0.3) ...
#15 268.0 Setting up python3-zipp (1.0.0-6) ...
#15 268.1 Setting up ghostscript (10.0.0~dfsg-11+deb12u7) ...
#15 268.2 Setting up python3-wheel (0.38.4-2) ...
#15 268.3 Setting up libboost-container-dev:amd64 (1.74.0.3) ...
#15 268.3 Setting up libboost-program-options1.74-dev:amd64 (1.74.0+ds1-21) ...
#15 268.4 Setting up texlive-bibtex-extra (2022.20230122-4) ...
#15 268.5 Setting up libkrb5-dev:amd64 (1.20.1-2+deb12u2) ...
#15 268.5 Setting up python3-pygments (2.14.0+dfsg-1) ...
#15 268.9 Setting up libboost-program-options-dev:amd64 (1.74.0.3) ...
#15 268.9 Setting up libpython3.11-dev:amd64 (3.11.2-6+deb12u5) ...
#15 269.0 Setting up libboost-system1.74-dev:amd64 (1.74.0+ds1-21) ...
#15 269.0 Setting up virtualenv (20.17.1+ds-1) ...
#15 269.1 Setting up libboost-random1.74-dev:amd64 (1.74.0+ds1-21) ...
#15 269.2 Setting up libboost-timer1.74-dev:amd64 (1.74.0+ds1-21) ...
#15 269.2 Setting up libelf-dev:amd64 (0.188-2.1) ...
#15 269.3 Setting up python3-pip (23.0.1+dfsg-1) ...
#15 269.8 Setting up texinfo (6.8-6+b1) ...
#15 269.9 Running mktexlsr. This may take some time. ... done.
#15 270.1 Setting up cppcheck (2.10-2) ...
#15 270.1 Setting up libboost-serialization1.74-dev:amd64 (1.74.0+ds1-21) ...
#15 270.2 Setting up libboost-atomic1.74-dev:amd64 (1.74.0+ds1-21) ...
#15 270.3 Setting up equivs (2.3.1) ...
#15 270.3 Setting up libboost-atomic-dev:amd64 (1.74.0.3) ...
#15 270.4 Setting up g++ (4:12.2.0-3) ...
#15 270.4 update-alternatives: using /usr/bin/g++ to provide /usr/bin/c++ (c++) in auto mode
#15 270.4 Setting up libboost-regex1.74-dev:amd64 (1.74.0+ds1-21) ...
#15 270.5 Setting up python3-astroid (2.14.2-1) ...
#15 270.7 Setting up libsnmp-dev (5.9.3+dfsg-2) ...
#15 271.2 Setting up build-essential (12.9) ...
#15 271.2 Setting up libzmq3-dev:amd64 (4.3.4-6) ...
#15 271.3 Setting up texlive-xetex (2022.20230122-3) ...
#15 271.4 Setting up libboost-dev:amd64 (1.74.0.3) ...
#15 271.4 Setting up libboost-math1.74-dev:amd64 (1.74.0+ds1-21) ...
#15 271.5 Setting up libboost-filesystem1.74-dev:amd64 (1.74.0+ds1-21) ...
#15 271.5 Setting up libopenmpi-dev:amd64 (4.1.4-3+b1) ...
#15 271.6 update-alternatives: using /usr/lib/x86_64-linux-gnu/openmpi/include to provide /usr/include/x86_64-linux-gnu/mpi (mpi-x86_64-linux-gnu) in auto mode
#15 271.6 Setting up libboost-stacktrace1.74-dev:amd64 (1.74.0+ds1-21) ...
#15 271.6 Setting up libboost-test1.74-dev:amd64 (1.74.0+ds1-21) ...
#15 271.7 Setting up libboost-regex-dev:amd64 (1.74.0.3) ...
#15 271.7 Setting up libmount-dev:amd64 (2.38.1-5+deb12u3) ...
#15 271.8 Setting up libboost-timer-dev:amd64 (1.74.0.3) ...
#15 271.8 Setting up libboost-filesystem-dev:amd64 (1.74.0.3) ...
#15 271.9 Setting up python3-mako (1.2.4+ds-1) ...
#15 272.0 Setting up libboost-mpi-python1.74.0 (1.74.0+ds1-21) ...
#15 272.2 Setting up libpython3-dev:amd64 (3.11.2-1+b1) ...
#15 272.2 Setting up python3-importlib-metadata (4.12.0-1) ...
#15 272.3 Setting up libboost-wave1.74-dev:amd64 (1.74.0+ds1-21) ...
#15 272.4 Setting up python3-logilab-common (1.9.8-1) ...
#15 272.6 Setting up libboost-chrono-dev:amd64 (1.74.0.3) ...
#15 272.6 Setting up python3.11-dev (3.11.2-6+deb12u5) ...
#15 272.7 Setting up libboost-math-dev:amd64 (1.74.0.3) ...
#15 272.7 Setting up libboost-system-dev:amd64 (1.74.0.3) ...
#15 272.8 Setting up dahdi-source (1:2.11.1.0.20170917~dfsg-8.4) ...
#15 272.8 Setting up libboost-random-dev:amd64 (1.74.0.3) ...
#15 272.9 Setting up libboost-wave-dev:amd64 (1.74.0.3) ...
#15 272.9 Setting up libboost-test-dev:amd64 (1.74.0.3) ...
#15 273.0 Setting up libboost-iostreams1.74-dev:amd64 (1.74.0+ds1-21) ...
#15 273.0 Setting up libboost-date-time1.74-dev:amd64 (1.74.0+ds1-21) ...
#15 273.1 Setting up texlive-formats-extra (2022.20230122-4) ...
#15 273.2 Setting up libglib2.0-dev:amd64 (2.74.6-2+deb12u5) ...
#15 273.2 Setting up libboost-graph1.74-dev:amd64 (1.74.0+ds1-21) ...
#15 273.3 Setting up python3-dev (3.11.2-1+b1) ...
#15 273.3 Setting up libboost-serialization-dev:amd64 (1.74.0.3) ...
#15 273.4 Setting up libboost-date-time-dev:amd64 (1.74.0.3) ...
#15 273.4 Setting up libboost-graph-parallel1.74-dev (1.74.0+ds1-21) ...
#15 273.5 Setting up mpi-default-dev (1.14) ...
#15 273.5 Setting up libboost-stacktrace-dev:amd64 (1.74.0.3) ...
#15 273.6 Setting up libboost-thread1.74-dev:amd64 (1.74.0+ds1-21) ...
#15 273.6 Setting up pylint (2.16.2-2) ...
#15 273.9 Setting up libboost-thread-dev:amd64 (1.74.0.3) ...
#15 274.0 Setting up libsofia-sip-ua-glib-dev (1.12.11+20110422.1+1e14eea~dfsg-6) ...
#15 274.0 Setting up libboost-graph-dev:amd64 (1.74.0.3) ...
#15 274.1 Setting up libboost-log1.74-dev (1.74.0+ds1-21) ...
#15 274.1 Setting up libboost-mpi1.74-dev (1.74.0+ds1-21) ...
#15 274.2 Setting up libboost-mpi-python1.74-dev (1.74.0+ds1-21) ...
#15 274.2 Setting up libboost-iostreams-dev:amd64 (1.74.0.3) ...
#15 274.3 Setting up libboost-context1.74-dev:amd64 (1.74.0+ds1-21) ...
#15 274.3 Setting up libboost-python1.74-dev (1.74.0+ds1-21) ...
#15 274.4 Setting up libboost-python-dev (1.74.0.3) ...
#15 274.5 Setting up libboost-fiber1.74-dev:amd64 (1.74.0+ds1-21) ...
#15 274.5 Setting up libboost-mpi-python-dev (1.74.0.3) ...
#15 274.6 Setting up libboost-type-erasure1.74-dev:amd64 (1.74.0+ds1-21) ...
#15 274.6 Setting up libboost-mpi-dev (1.74.0.3) ...
#15 274.7 Setting up libboost-locale1.74-dev:amd64 (1.74.0+ds1-21) ...
#15 274.7 Setting up libboost-graph-parallel-dev (1.74.0.3) ...
#15 274.8 Setting up libboost-coroutine1.74-dev:amd64 (1.74.0+ds1-21) ...
#15 274.8 Setting up libboost-coroutine-dev:amd64 (1.74.0.3) ...
#15 274.9 Setting up libboost-log-dev (1.74.0.3) ...
#15 274.9 Setting up libboost-fiber-dev:amd64 (1.74.0.3) ...
#15 275.0 Setting up libboost-locale-dev:amd64 (1.74.0.3) ...
#15 275.0 Setting up libboost-context-dev:amd64 (1.74.0.3) ...
#15 275.1 Setting up libboost-type-erasure-dev:amd64 (1.74.0.3) ...
#15 275.1 Setting up libboost-all-dev (1.74.0.3) ...
#15 275.2 Setting up libdevmapper1.02.1:amd64 (2:1.02.185-2) ...
#15 275.3 Setting up dmsetup (2:1.02.185-2) ...
#15 275.3 Setting up libcryptsetup12:amd64 (2:2.6.1-4~deb12u2) ...
#15 275.4 Setting up libwww-perl (6.68-1) ...
#15 275.4 Setting up systemd (252.36-1~deb12u1) ...
#15 275.6 Created symlink /etc/systemd/system/getty.target.wants/getty@tty1.service → /lib/systemd/system/getty@.service.
#15 275.6 Created symlink /etc/systemd/system/multi-user.target.wants/remote-fs.target → /lib/systemd/system/remote-fs.target.
#15 275.6 Created symlink /etc/systemd/system/sysinit.target.wants/systemd-pstore.service → /lib/systemd/system/systemd-pstore.service.
#15 275.6 Initializing machine ID from D-Bus machine ID.
#15 275.7 Creating group 'systemd-journal' with GID 999.
#15 275.7 Creating group 'systemd-network' with GID 998.
#15 275.7 Creating user 'systemd-network' (systemd Network Management) with UID 998 and GID 998.
#15 275.8 Setting up devscripts (2.23.4+deb12u2) ...
#15 276.0 Setting up liblwp-protocol-https-perl (6.10-1) ...
#15 276.0 Processing triggers for libc-bin (2.36-9+deb12u10) ...
#15 276.1 Processing triggers for sgml-base (1.31) ...
#15 276.2 Setting up libdbus-1-dev:amd64 (1.14.10-1~deb12u1) ...
#15 276.4 Setting up docbook-xsl (1.79.2+dfsg-2) ...
#15 276.5 Setting up docutils-common (0.19+dfsg-6) ...
#15 276.8 Setting up sgml-data (2.0.11+nmu1) ...
#15 277.0 Setting up libpcap0.8-dev:amd64 (1.10.3-1) ...
#15 277.1 Setting up docbook5-xml (5.0-3) ...
#15 277.2 Setting up asciidoc-base (10.2.0-1) ...
#15 277.6 Setting up libpcap-dev:amd64 (1.10.3-1) ...
#15 277.7 Setting up asciidoc (10.2.0-1) ...
#15 278.0 Processing triggers for sgml-base (1.31) ...
#15 278.1 Setting up docbook (4.5-10) ...
#15 278.4 Setting up python3-docutils (0.19+dfsg-6) ...
#15 278.6 Setting up docbook-xml (4.5-12) ...
#15 279.5 Setting up python3-blockdiag (2.0.1+dfsg-1) ...
#15 279.7 Setting up python3-nwdiag (2.0.0+dfsg-1.1) ...
#15 279.9 Processing triggers for sgml-base (1.31) ...
#15 279.9 Setting up dblatex (0.3.12py3-2) ...
#15 280.1 Setting up docbook-dsssl (1.79-10) ...
#15 280.2 Processing triggers for sgml-base (1.31) ...
#15 280.3 Setting up docbook-utils (0.6.14-4) ...
#15 280.4 Setting up asciidoc-dblatex (10.2.0-1) ...
#15 280.5 Processing triggers for dbus (1.14.10-1~deb12u1) ...
#15 280.5 Processing triggers for tex-common (6.18) ...
#15 280.6 debconf: unable to initialize frontend: Dialog
#15 280.6 debconf: (TERM is not set, so the dialog frontend is not usable.)
#15 280.6 debconf: falling back to frontend: Readline
#15 280.6 debconf: unable to initialize frontend: Readline
#15 280.6 debconf: (This frontend requires a controlling tty.)
#15 280.6 debconf: falling back to frontend: Teletype
#15 280.6 Running updmap-sys. This may take some time... done.
#15 281.0 Running mktexlsr /var/lib/texmf ... done.
#15 281.1 Building format(s) --all.
#15 281.1 This may take some time... done.
#15 312.6 + apt-get clean
#15 DONE 312.9s
#16 [ 7/16] ADD HTTPS://GITEA.OSMOCOM.ORG/SIM-CARD/PYSIM/RAW/BRANCH/MASTER/REQUIREMENTS.TXT /tmp/pysim_requirements.txt
#16 DONE 0.1s
#17 [ 8/16] RUN SET -x && cat /tmp/pysim_requirements.txt && pip3 install --break-system-packages 'git+https://github.com/eriwen/lcov-to-cobertura-xml.git' 'git+https://github.com/osmocom/sphinx-argparse@inside-classes#egg=sphinx-argparse' 'git+https://github.com/podshumok/python-smpplib.git' 'pydbus' 'pysispm' 'ruff' 'sphinx' 'sphinxcontrib-napoleon' -r /tmp/pysim_requirements.txt
#17 0.264 + cat /tmp/pysim_requirements.txt
#17 0.265 pyscard
#17 0.265 pyserial
#17 0.265 pytlv
#17 0.265 cmd2>=1.5
#17 0.265 jsonpath-ng
#17 0.265 construct>=2.10.70
#17 0.265 bidict
#17 0.265 pyosmocom>=0.0.8
#17 0.265 pyyaml>=5.1
#17 0.265 termcolor
#17 0.265 colorlog
#17 0.265 pycryptodomex
#17 0.265 cryptography
#17 0.265 git+https://github.com/osmocom/asn1tools
#17 0.265 packaging
#17 0.265 git+https://github.com/hologram-io/smpp.pdu
#17 0.265 + pip3 install --break-system-packages git+https://github.com/eriwen/lcov-to-cobertura-xml.git git+https://github.com/osmocom/sphinx-argparse@inside-classes#egg=sphinx-argparse git+https://github.com/podshumok/python-smpplib.git pydbus pysispm ruff sphinx sphinxcontrib-napoleon -r /tmp/pysim_requirements.txt
#17 0.455 Collecting git+https://github.com/eriwen/lcov-to-cobertura-xml.git
#17 0.455 Cloning https://github.com/eriwen/lcov-to-cobertura-xml.git to /tmp/pip-req-build-1fplm8hp
#17 0.456 Running command git clone --filter=blob:none --quiet https://github.com/eriwen/lcov-to-cobertura-xml.git /tmp/pip-req-build-1fplm8hp
#17 1.177 Resolved https://github.com/eriwen/lcov-to-cobertura-xml.git to commit 85f51dfd646fadf534ce2bd636befeec37148ff9
#17 1.181 Installing build dependencies: started
#17 2.384 Installing build dependencies: finished with status 'done'
#17 2.385 Getting requirements to build wheel: started
#17 2.476 Getting requirements to build wheel: finished with status 'error'
#17 2.479 error: subprocess-exited-with-error
#17 2.479
#17 2.479 × Getting requirements to build wheel did not run successfully.
#17 2.479 │ exit code: 1
#17 2.479 ╰─> [28 lines of output]
#17 2.479 Traceback (most recent call last):
#17 2.479 File "/usr/lib/python3/dist-packages/pip/_vendor/pyproject_hooks/_in_process/_in_process.py", line 353, in <module>
#17 2.479 main()
#17 2.479 File "/usr/lib/python3/dist-packages/pip/_vendor/pyproject_hooks/_in_process/_in_process.py", line 335, in main
#17 2.479 json_out['return_val'] = hook(**hook_input['kwargs'])
#17 2.479 ^^^^^^^^^^^^^^^^^^^^^^^^^^^^
#17 2.479 File "/usr/lib/python3/dist-packages/pip/_vendor/pyproject_hooks/_in_process/_in_process.py", line 118, in get_requires_for_build_wheel
#17 2.479 return hook(config_settings)
#17 2.479 ^^^^^^^^^^^^^^^^^^^^^
#17 2.479 File "/tmp/pip-build-env-el7u900w/overlay/local/lib/python3.11/dist-packages/setuptools/build_meta.py", line 334, in get_requires_for_build_wheel
#17 2.479 return self._get_build_requires(config_settings, requirements=[])
#17 2.479 ^^^^^^^^^^^^^^^^^^^^^^^^^^^^^^^^^^^^^^^^^^^^^^^^^^^^^^^^^^
#17 2.479 File "/tmp/pip-build-env-el7u900w/overlay/local/lib/python3.11/dist-packages/setuptools/build_meta.py", line 304, in _get_build_requires
#17 2.479 self.run_setup()
#17 2.479 File "/tmp/pip-build-env-el7u900w/overlay/local/lib/python3.11/dist-packages/setuptools/build_meta.py", line 320, in run_setup
#17 2.479 exec(code, locals())
#17 2.479 File "<string>", line 3, in <module>
#17 2.479 File "/tmp/pip-build-env-el7u900w/overlay/local/lib/python3.11/dist-packages/setuptools/__init__.py", line 116, in setup
#17 2.479 _install_setup_requires(attrs)
#17 2.479 File "/tmp/pip-build-env-el7u900w/overlay/local/lib/python3.11/dist-packages/setuptools/__init__.py", line 87, in _install_setup_requires
#17 2.479 dist.parse_config_files(ignore_option_errors=True)
#17 2.479 File "/tmp/pip-build-env-el7u900w/overlay/local/lib/python3.11/dist-packages/setuptools/dist.py", line 759, in parse_config_files
#17 2.479 self._finalize_license_expression()
#17 2.479 File "/tmp/pip-build-env-el7u900w/overlay/local/lib/python3.11/dist-packages/setuptools/dist.py", line 432, in _finalize_license_expression
#17 2.479 raise InvalidConfigError(
#17 2.479 setuptools.errors.InvalidConfigError: License classifiers have been superseded by license expressions (see https://peps.python.org/pep-0639/). Please remove:
#17 2.479
#17 2.479 License :: OSI Approved :: Apache Software License
#17 2.479 [end of output]
#17 2.479
#17 2.479 note: This error originates from a subprocess, and is likely not a problem with pip.
#17 2.480 error: subprocess-exited-with-error
#17 2.480
#17 2.480 × Getting requirements to build wheel did not run successfully.
#17 2.480 │ exit code: 1
#17 2.480 ╰─> See above for output.
#17 2.480
#17 2.480 note: This error originates from a subprocess, and is likely not a problem with pip.
#17 ERROR: process "/bin/sh -c set -x && \tcat /tmp/pysim_requirements.txt && \tpip3 install --break-system-packages \t\t'git+https://github.com/eriwen/lcov-to-cobertura-xml.git' \t\t'git+https://github.com/osmocom/sphinx-argparse@inside-classes#egg=sphinx-argparse' \t\t'git+https://github.com/podshumok/python-smpplib.git' \t\t'pydbus' \t\t'pysispm' \t\t'ruff' \t\t'sphinx' \t\t'sphinxcontrib-napoleon' \t\t-r /tmp/pysim_requirements.txt" did not complete successfully: exit code: 1
------
> [ 8/16] RUN SET -x && cat /tmp/pysim_requirements.txt && pip3 install --break-system-packages 'git+https://github.com/eriwen/lcov-to-cobertura-xml.git' 'git+https://github.com/osmocom/sphinx-argparse@inside-classes#egg=sphinx-argparse' 'git+https://github.com/podshumok/python-smpplib.git' 'pydbus' 'pysispm' 'ruff' 'sphinx' 'sphinxcontrib-napoleon' -r /tmp/pysim_requirements.txt:
2.479 [end of output]
2.479
2.479 note: This error originates from a subprocess, and is likely not a problem with pip.
2.480 error: subprocess-exited-with-error
2.480
2.480 × Getting requirements to build wheel did not run successfully.
2.480 │ exit code: 1
2.480 ╰─> See above for output.
2.480
2.480 note: This error originates from a subprocess, and is likely not a problem with pip.
------
Dockerfile:177
--------------------
176 | ADD https://gitea.osmocom.org/sim-card/pysim/raw/branch/master/requirements.txt /tmp/pysim_requirements.txt
177 | >>> RUN set -x && \
178 | >>> cat /tmp/pysim_requirements.txt && \
179 | >>> pip3 install --break-system-packages \
180 | >>> 'git+https://github.com/eriwen/lcov-to-cobertura-xml.git' \
181 | >>> 'git+https://github.com/osmocom/sphinx-argparse@inside-classes#egg=sphinx-argparse' \
182 | >>> 'git+https://github.com/podshumok/python-smpplib.git' \
183 | >>> 'pydbus' \
184 | >>> 'pysispm' \
185 | >>> 'ruff' \
186 | >>> 'sphinx' \
187 | >>> 'sphinxcontrib-napoleon' \
188 | >>> -r /tmp/pysim_requirements.txt
189 |
--------------------
ERROR: failed to solve: process "/bin/sh -c set -x && \tcat /tmp/pysim_requirements.txt && \tpip3 install --break-system-packages \t\t'git+https://github.com/eriwen/lcov-to-cobertura-xml.git' \t\t'git+https://github.com/osmocom/sphinx-argparse@inside-classes#egg=sphinx-argparse' \t\t'git+https://github.com/podshumok/python-smpplib.git' \t\t'pydbus' \t\t'pysispm' \t\t'ruff' \t\t'sphinx' \t\t'sphinxcontrib-napoleon' \t\t-r /tmp/pysim_requirements.txt" did not complete successfully: exit code: 1
make: *** [../make/Makefile:95: docker-build] Error 1
make: Leaving directory '/home/osmocom-build/jenkins/workspace/update-osmo-ci-on-slaves/label/build4-deb12build-ansible/_docker_playground/debian-bookworm-build'
+ exit 1
Build step 'Execute shell' marked build as failure
Sending e-mails to: jenkins-notifications@lists.osmocom.org
Finished: FAILURE