Skip to content

Console Output

Skipping 2,921 KB.. Full Log
Notify: File `RLCMAC_CSN1_Types_part_4.cc' was generated.
Notify: File `RLCMAC_CSN1_Types_part_5.cc' was generated.
Notify: File `RLCMAC_CSN1_Types_part_6.cc' was generated.
Notify: File `RLCMAC_CSN1_Types_part_7.cc' was generated.
Notify: File `RSL_Types.hh' was generated.
Notify: File `RSL_Types.cc' was generated.
Notify: File `RSL_Types_part_1.cc' was generated.
Notify: File `RSL_Types_part_2.cc' was generated.
Notify: File `RSL_Types_part_3.cc' was generated.
Notify: File `RSL_Types_part_4.cc' was generated.
Notify: File `RSL_Types_part_5.cc' was generated.
Notify: File `RSL_Types_part_6.cc' was generated.
Notify: File `RSL_Types_part_7.cc' was generated.
Notify: File `SCCP_Emulation.hh' was generated.
Notify: File `SCCP_Emulation.cc' was generated.
Notify: File `SCCP_Emulation_part_1.cc' was generated.
Notify: File `SCCP_Emulation_part_2.cc' was generated.
Notify: File `SCCP_Emulation_part_3.cc' was generated.
Notify: File `SCCP_Emulation_part_4.cc' was generated.
Notify: File `SCCP_Emulation_part_5.cc' was generated.
Notify: File `SCCP_Emulation_part_6.cc' was generated.
Notify: File `SCCP_Emulation_part_7.cc' was generated.
Notify: File `SCCP_Mapping.hh' was generated.
Notify: File `SCCP_Mapping.cc' was generated.
Notify: File `SCCP_Mapping_part_1.cc' was generated.
Notify: File `SCCP_Mapping_part_2.cc' was generated.
Notify: File `SCCP_Mapping_part_3.cc' was generated.
Notify: File `SCCP_Mapping_part_4.cc' was generated.
Notify: File `SCCP_Mapping_part_5.cc' was generated.
Notify: File `SCCP_Mapping_part_6.cc' was generated.
Notify: File `SCCP_Mapping_part_7.cc' was generated.
Notify: File `SCCP_Types.hh' was generated.
Notify: File `SCCP_Types.cc' was generated.
Notify: File `SCCP_Types_part_1.cc' was generated.
Notify: File `SCCP_Types_part_2.cc' was generated.
Notify: File `SCCP_Types_part_3.cc' was generated.
Notify: File `SCCP_Types_part_4.cc' was generated.
Notify: File `SCCP_Types_part_5.cc' was generated.
Notify: File `SCCP_Types_part_6.cc' was generated.
Notify: File `SCCP_Types_part_7.cc' was generated.
Notify: File `SCCPasp_Types.hh' was generated.
Notify: File `SCCPasp_Types.cc' was generated.
Notify: File `SCCPasp_Types_part_1.cc' was generated.
Notify: File `SCCPasp_Types_part_2.cc' was generated.
Notify: File `SCCPasp_Types_part_3.cc' was generated.
Notify: File `SCCPasp_Types_part_4.cc' was generated.
Notify: File `SCCPasp_Types_part_5.cc' was generated.
Notify: File `SCCPasp_Types_part_6.cc' was generated.
Notify: File `SCCPasp_Types_part_7.cc' was generated.
Notify: File `Selftest.hh' was generated.
Notify: File `Selftest.cc' was generated.
Notify: File `Selftest_part_1.cc' was generated.
Notify: File `Selftest_part_2.cc' was generated.
Notify: File `Selftest_part_3.cc' was generated.
Notify: File `Selftest_part_4.cc' was generated.
Notify: File `Selftest_part_5.cc' was generated.
Notify: File `Selftest_part_6.cc' was generated.
Notify: File `Selftest_part_7.cc' was generated.
Notify: File `Socket_API_Definitions.hh' was generated.
Notify: File `Socket_API_Definitions.cc' was generated.
Notify: File `Socket_API_Definitions_part_1.cc' was generated.
Notify: File `Socket_API_Definitions_part_2.cc' was generated.
Notify: File `Socket_API_Definitions_part_3.cc' was generated.
Notify: File `Socket_API_Definitions_part_4.cc' was generated.
Notify: File `Socket_API_Definitions_part_5.cc' was generated.
Notify: File `Socket_API_Definitions_part_6.cc' was generated.
Notify: File `Socket_API_Definitions_part_7.cc' was generated.
Notify: File `TCCConversion_Functions.hh' was generated.
Notify: File `TCCConversion_Functions.cc' was generated.
Notify: File `TCCConversion_Functions_part_1.cc' was generated.
Notify: File `TCCConversion_Functions_part_2.cc' was generated.
Notify: File `TCCConversion_Functions_part_3.cc' was generated.
Notify: File `TCCConversion_Functions_part_4.cc' was generated.
Notify: File `TCCConversion_Functions_part_5.cc' was generated.
Notify: File `TCCConversion_Functions_part_6.cc' was generated.
Notify: File `TCCConversion_Functions_part_7.cc' was generated.
Notify: File `TCCInterface_Functions.hh' was generated.
Notify: File `TCCInterface_Functions.cc' was generated.
Notify: File `TCCInterface_Functions_part_1.cc' was generated.
Notify: File `TCCInterface_Functions_part_2.cc' was generated.
Notify: File `TCCInterface_Functions_part_3.cc' was generated.
Notify: File `TCCInterface_Functions_part_4.cc' was generated.
Notify: File `TCCInterface_Functions_part_5.cc' was generated.
Notify: File `TCCInterface_Functions_part_6.cc' was generated.
Notify: File `TCCInterface_Functions_part_7.cc' was generated.
Notify: 387 files were updated.
touch compile
make[1]: Leaving directory '/build/selftest'
(cd sgsn && ./gen_links.sh && ./regen_makefile.sh)
Linking TCCInterface_Functions.ttcn
Linking TCCConversion_Functions.ttcn
Linking TCCConversion.cc
Linking TCCInterface.cc
Linking TCCInterface_ip.h
Linking Socket_API_Definitions.ttcn
Linking IPL4asp_Functions.ttcn
Linking IPL4asp_PT.cc
Linking IPL4asp_PT.hh
Linking IPL4asp_PortType.ttcn
Linking IPL4asp_Types.ttcn
Linking IPL4asp_discovery.cc
Linking IPL4asp_protocol_L234.hh
Linking TELNETasp_PT.cc
Linking TELNETasp_PT.hh
Linking TELNETasp_PortType.ttcn
Linking NS_Types.ttcn
Linking BSSGP_EncDec.cc
Linking BSSGP_Types.ttcn
Linking LLC_EncDec.cc
Linking LLC_Types.ttcn
Linking SNDCP_Types.ttcn
Linking MobileL3_CC_Types.ttcn
Linking MobileL3_CommonIE_Types.ttcn
Linking MobileL3_GMM_SM_Types.ttcn
Linking MobileL3_MM_Types.ttcn
Linking MobileL3_RRM_Types.ttcn
Linking MobileL3_SMS_Types.ttcn
Linking MobileL3_SS_Types.ttcn
Linking MobileL3_Types.ttcn
Linking GTPC_EncDec.cc
Linking GTPC_Types.ttcn
Linking GTPU_EncDec.cc
Linking GTPU_Types.ttcn
Linking M3UA_Types.ttcn
Linking SCTPasp_PT.cc
Linking SCTPasp_PT.hh
Linking SCTPasp_PortType.ttcn
Linking SCTPasp_Types.ttcn
Linking MTP3asp_PortType.ttcn
Linking MTP3asp_Types.ttcn
Linking M3UA_Emulation.ttcn
Linking SCCP_Emulation.ttcn
Linking SCCP_EncDec.cc
Linking SCCP_Mapping.ttcnpp
Linking SCCP_Types.ttcn
Linking SCCPasp_Types.ttcn
Linking RANAP_CommonDataTypes.asn
Linking RANAP_Constants.asn
Linking RANAP_Containers.asn
Linking RANAP_IEs.asn
Linking RANAP_PDU_Contents.asn
Linking RANAP_PDU_Descriptions.asn
Linking RANAP_Types.ttcn
Linking RANAP_Templates.ttcn
Linking RANAP_CodecPort.ttcn
Linking RANAP_EncDec.cc
Linking Misc_Helpers.ttcn
Linking General_Types.ttcn
Linking GSM_Types.ttcn
Linking Osmocom_Types.ttcn
Linking RAW_NS.ttcnpp
Linking NS_Provider_IPL4.ttcn
Linking NS_Emulation.ttcnpp
Linking BSSGP_Emulation.ttcnpp
Linking Osmocom_Gb_Types.ttcn
Linking Osmocom_CTRL_Types.ttcn
Linking Osmocom_CTRL_Functions.ttcn
Linking Osmocom_CTRL_Adapter.ttcn
Linking Osmocom_VTY_Functions.ttcn
Linking LLC_Templates.ttcn
Linking L3_Templates.ttcn
Linking L3_Common.ttcn
Linking RAN_Emulation.ttcnpp
Linking RAN_Adapter.ttcnpp
Linking SCCP_Templates.ttcn
Linking IPA_Types.ttcn
Linking IPA_Emulation.ttcnpp
Linking IPA_CodecPort.ttcn
Linking IPA_CodecPort_CtrlFunct.ttcn
Linking IPA_CodecPort_CtrlFunctDef.cc
Linking Native_Functions.ttcn
Linking Native_FunctionDefs.cc
Linking PCO_Types.ttcn
Linking GSUP_Types.ttcn
Linking GSUP_Templates.ttcn
Linking GSUP_Emulation.ttcn
Linking GTPv1C_CodecPort.ttcn
Linking GTPv1C_CodecPort_CtrlFunct.ttcn
Linking GTPv1C_CodecPort_CtrlFunctDef.cc
Linking GTPv1C_Templates.ttcn
Linking Osmocom_Gb_Types.ttcn
Linking GTPv1U_CodecPort.ttcn
Linking GTPv1U_CodecPort_CtrlFunct.ttcn
Linking GTPv1U_CodecPort_CtrlFunctDef.cc
Linking GTPv1U_Templates.ttcn
Linking GTP_Emulation.ttcn
Linking IPCP_Types.ttcn
Linking RAW_NS.ttcnpp
Generating Makefile skeleton...
Makefile skeleton was generated.
make -C sgsn compile
make[1]: Entering directory '/build/sgsn'
cpp -x c -nostdinc -DBSSGP_EM_L3 -DIPA_EMULATION_CTRL -DIPA_EMULATION_GSUP -DRAN_EMULATION_RANAP -DUSE_MTP3_DISTRIBUTOR BSSGP_Emulation.ttcnpp BSSGP_Emulation.ttcn
cpp -x c -nostdinc -DBSSGP_EM_L3 -DIPA_EMULATION_CTRL -DIPA_EMULATION_GSUP -DRAN_EMULATION_RANAP -DUSE_MTP3_DISTRIBUTOR IPA_Emulation.ttcnpp IPA_Emulation.ttcn
cpp -x c -nostdinc -DBSSGP_EM_L3 -DIPA_EMULATION_CTRL -DIPA_EMULATION_GSUP -DRAN_EMULATION_RANAP -DUSE_MTP3_DISTRIBUTOR NS_Emulation.ttcnpp NS_Emulation.ttcn
cpp -x c -nostdinc -DBSSGP_EM_L3 -DIPA_EMULATION_CTRL -DIPA_EMULATION_GSUP -DRAN_EMULATION_RANAP -DUSE_MTP3_DISTRIBUTOR RAN_Adapter.ttcnpp RAN_Adapter.ttcn
cpp -x c -nostdinc -DBSSGP_EM_L3 -DIPA_EMULATION_CTRL -DIPA_EMULATION_GSUP -DRAN_EMULATION_RANAP -DUSE_MTP3_DISTRIBUTOR RAN_Emulation.ttcnpp RAN_Emulation.ttcn
cpp -x c -nostdinc -DBSSGP_EM_L3 -DIPA_EMULATION_CTRL -DIPA_EMULATION_GSUP -DRAN_EMULATION_RANAP -DUSE_MTP3_DISTRIBUTOR RAW_NS.ttcnpp RAW_NS.ttcn
RAW_NS.ttcnpp:135:8: warning: extra tokens at end of #endif directive [-Wendif-labels]
  135 | #endif NS_EMULATION_FR
      |        ^~~~~~~~~~~~~~~
cpp -x c -nostdinc -DBSSGP_EM_L3 -DIPA_EMULATION_CTRL -DIPA_EMULATION_GSUP -DRAN_EMULATION_RANAP -DUSE_MTP3_DISTRIBUTOR SCCP_Mapping.ttcnpp SCCP_Mapping.ttcn
SCCP_Mapping.ttcnpp:49:4: warning: missing terminating " character
   49 |    "internal user MTP3asp_PT
      |    ^
SCCP_Mapping.ttcnpp:58:4: warning: missing terminating " character
   58 |    "
      |    ^
SCCP_Mapping.ttcnpp:70:4: warning: missing terminating " character
   70 |    "user MTP3asp_PT
      |    ^
SCCP_Mapping.ttcnpp:79:4: warning: missing terminating " character
   79 |    "
      |    ^
/usr/bin/ttcn3_compiler -L -U 8 BSSGP_Types.ttcn GSM_Types.ttcn GSUP_Emulation.ttcn GSUP_Templates.ttcn GSUP_Types.ttcn GTPC_Types.ttcn GTPU_Types.ttcn GTP_Emulation.ttcn GTPv1C_CodecPort.ttcn GTPv1C_CodecPort_CtrlFunct.ttcn GTPv1C_Templates.ttcn GTPv1U_CodecPort.ttcn GTPv1U_CodecPort_CtrlFunct.ttcn GTPv1U_Templates.ttcn General_Types.ttcn IPA_CodecPort.ttcn IPA_CodecPort_CtrlFunct.ttcn IPA_Types.ttcn IPCP_Types.ttcn IPL4asp_Functions.ttcn IPL4asp_PortType.ttcn IPL4asp_Types.ttcn L3_Common.ttcn L3_Templates.ttcn LLC_Templates.ttcn LLC_Types.ttcn M3UA_Emulation.ttcn M3UA_Types.ttcn MTP3asp_PortType.ttcn MTP3asp_Types.ttcn Misc_Helpers.ttcn MobileL3_CC_Types.ttcn MobileL3_CommonIE_Types.ttcn MobileL3_GMM_SM_Types.ttcn MobileL3_MM_Types.ttcn MobileL3_RRM_Types.ttcn MobileL3_SMS_Types.ttcn MobileL3_SS_Types.ttcn MobileL3_Types.ttcn NS_Provider_IPL4.ttcn NS_Types.ttcn Native_Functions.ttcn Osmocom_CTRL_Adapter.ttcn Osmocom_CTRL_Functions.ttcn Osmocom_CTRL_Types.ttcn Osmocom_Gb_Types.ttcn Osmocom_Types.ttcn Osmocom_VTY_Functions.ttcn PCO_Types.ttcn RANAP_CodecPort.ttcn RANAP_Templates.ttcn RANAP_Types.ttcn SCCP_Emulation.ttcn SCCP_Templates.ttcn SCCP_Types.ttcn SCCPasp_Types.ttcn SCTPasp_PortType.ttcn SCTPasp_Types.ttcn SGSN_Tests.ttcn SGSN_Tests_Iu.ttcn SGSN_Tests_NS.ttcn SNDCP_Types.ttcn Socket_API_Definitions.ttcn TCCConversion_Functions.ttcn TCCInterface_Functions.ttcn TELNETasp_PortType.ttcn BSSGP_Emulation.ttcn IPA_Emulation.ttcn NS_Emulation.ttcn RAN_Adapter.ttcn RAN_Emulation.ttcn RAW_NS.ttcn SCCP_Mapping.ttcn RANAP_CommonDataTypes.asn RANAP_Constants.asn RANAP_Containers.asn RANAP_IEs.asn RANAP_PDU_Contents.asn RANAP_PDU_Descriptions.asn - BSSGP_Types.ttcn GSM_Types.ttcn GSUP_Emulation.ttcn GSUP_Templates.ttcn GSUP_Types.ttcn GTPC_Types.ttcn GTPU_Types.ttcn GTP_Emulation.ttcn GTPv1C_CodecPort.ttcn GTPv1C_CodecPort_CtrlFunct.ttcn GTPv1C_Templates.ttcn GTPv1U_CodecPort.ttcn GTPv1U_CodecPort_CtrlFunct.ttcn GTPv1U_Templates.ttcn General_Types.ttcn IPA_CodecPort.ttcn IPA_CodecPort_CtrlFunct.ttcn IPA_Types.ttcn IPCP_Types.ttcn IPL4asp_Functions.ttcn IPL4asp_PortType.ttcn IPL4asp_Types.ttcn L3_Common.ttcn L3_Templates.ttcn LLC_Templates.ttcn LLC_Types.ttcn M3UA_Emulation.ttcn M3UA_Types.ttcn MTP3asp_PortType.ttcn MTP3asp_Types.ttcn Misc_Helpers.ttcn MobileL3_CC_Types.ttcn MobileL3_CommonIE_Types.ttcn MobileL3_GMM_SM_Types.ttcn MobileL3_MM_Types.ttcn MobileL3_RRM_Types.ttcn MobileL3_SMS_Types.ttcn MobileL3_SS_Types.ttcn MobileL3_Types.ttcn NS_Provider_IPL4.ttcn NS_Types.ttcn Native_Functions.ttcn Osmocom_CTRL_Adapter.ttcn Osmocom_CTRL_Functions.ttcn Osmocom_CTRL_Types.ttcn Osmocom_Gb_Types.ttcn Osmocom_Types.ttcn Osmocom_VTY_Functions.ttcn PCO_Types.ttcn RANAP_CodecPort.ttcn RANAP_Templates.ttcn RANAP_Types.ttcn SCCP_Emulation.ttcn SCCP_Templates.ttcn SCCP_Types.ttcn SCCPasp_Types.ttcn SCTPasp_PortType.ttcn SCTPasp_Types.ttcn SGSN_Tests.ttcn SGSN_Tests_Iu.ttcn SGSN_Tests_NS.ttcn SNDCP_Types.ttcn Socket_API_Definitions.ttcn TCCConversion_Functions.ttcn TCCInterface_Functions.ttcn TELNETasp_PortType.ttcn BSSGP_Emulation.ttcn IPA_Emulation.ttcn NS_Emulation.ttcn RAN_Adapter.ttcn RAN_Emulation.ttcn RAW_NS.ttcn SCCP_Mapping.ttcn RANAP_CommonDataTypes.asn RANAP_Constants.asn RANAP_Containers.asn RANAP_IEs.asn RANAP_PDU_Contents.asn RANAP_PDU_Descriptions.asn
warning: Charstring pattern: Environment variable TTCN3_DIR not present. Case-insensitive universal charstring patterns are disabled.

Notify: Parsing TTCN-3 module `BSSGP_Types.ttcn'...
Notify: Parsing TTCN-3 module `GSM_Types.ttcn'...
Notify: Parsing TTCN-3 module `GSUP_Emulation.ttcn'...
Notify: Parsing TTCN-3 module `GSUP_Templates.ttcn'...
Notify: Parsing TTCN-3 module `GSUP_Types.ttcn'...
Notify: Parsing TTCN-3 module `GTPC_Types.ttcn'...
Notify: Parsing TTCN-3 module `GTPU_Types.ttcn'...
Notify: Parsing TTCN-3 module `GTP_Emulation.ttcn'...
Notify: Parsing TTCN-3 module `GTPv1C_CodecPort.ttcn'...
Notify: Parsing TTCN-3 module `GTPv1C_CodecPort_CtrlFunct.ttcn'...
Notify: Parsing TTCN-3 module `GTPv1C_Templates.ttcn'...
Notify: Parsing TTCN-3 module `GTPv1U_CodecPort.ttcn'...
Notify: Parsing TTCN-3 module `GTPv1U_CodecPort_CtrlFunct.ttcn'...
Notify: Parsing TTCN-3 module `GTPv1U_Templates.ttcn'...
Notify: Parsing TTCN-3 module `General_Types.ttcn'...
Notify: Parsing TTCN-3 module `IPA_CodecPort.ttcn'...
Notify: Parsing TTCN-3 module `IPA_CodecPort_CtrlFunct.ttcn'...
Notify: Parsing TTCN-3 module `IPA_Types.ttcn'...
Notify: Parsing TTCN-3 module `IPCP_Types.ttcn'...
Notify: Parsing TTCN-3 module `IPL4asp_Functions.ttcn'...
Notify: Parsing TTCN-3 module `IPL4asp_PortType.ttcn'...
Notify: Parsing TTCN-3 module `IPL4asp_Types.ttcn'...
Notify: Parsing TTCN-3 module `L3_Common.ttcn'...
Notify: Parsing TTCN-3 module `L3_Templates.ttcn'...
Notify: Parsing TTCN-3 module `LLC_Templates.ttcn'...
Notify: Parsing TTCN-3 module `LLC_Types.ttcn'...
Notify: Parsing TTCN-3 module `M3UA_Emulation.ttcn'...
Notify: Parsing TTCN-3 module `M3UA_Types.ttcn'...
Notify: Parsing TTCN-3 module `MTP3asp_PortType.ttcn'...
Notify: Parsing TTCN-3 module `MTP3asp_Types.ttcn'...
Notify: Parsing TTCN-3 module `Misc_Helpers.ttcn'...
Notify: Parsing TTCN-3 module `MobileL3_CC_Types.ttcn'...
Notify: Parsing TTCN-3 module `MobileL3_CommonIE_Types.ttcn'...
Notify: Parsing TTCN-3 module `MobileL3_GMM_SM_Types.ttcn'...
Notify: Parsing TTCN-3 module `MobileL3_MM_Types.ttcn'...
Notify: Parsing TTCN-3 module `MobileL3_RRM_Types.ttcn'...
Notify: Parsing TTCN-3 module `MobileL3_SMS_Types.ttcn'...
Notify: Parsing TTCN-3 module `MobileL3_SS_Types.ttcn'...
Notify: Parsing TTCN-3 module `MobileL3_Types.ttcn'...
Notify: Parsing TTCN-3 module `NS_Provider_IPL4.ttcn'...
Notify: Parsing TTCN-3 module `NS_Types.ttcn'...
Notify: Parsing TTCN-3 module `Native_Functions.ttcn'...
Notify: Parsing TTCN-3 module `Osmocom_CTRL_Adapter.ttcn'...
Notify: Parsing TTCN-3 module `Osmocom_CTRL_Functions.ttcn'...
Notify: Parsing TTCN-3 module `Osmocom_CTRL_Types.ttcn'...
Osmocom_CTRL_Types.ttcn:26.39-88: In character string pattern:
 Osmocom_CTRL_Types.ttcn:26.44-45: warning: Use of unrecognized escape sequence `\{' is deprecated
 Osmocom_CTRL_Types.ttcn:26.46-47: warning: Use of unrecognized escape sequence `\}' is deprecated
Notify: Parsing TTCN-3 module `Osmocom_Gb_Types.ttcn'...
Notify: Parsing TTCN-3 module `Osmocom_Types.ttcn'...
Notify: Parsing TTCN-3 module `Osmocom_VTY_Functions.ttcn'...
Notify: Parsing TTCN-3 module `PCO_Types.ttcn'...
Notify: Parsing TTCN-3 module `RANAP_CodecPort.ttcn'...
Notify: Parsing TTCN-3 module `RANAP_Templates.ttcn'...
Notify: Parsing TTCN-3 module `RANAP_Types.ttcn'...
Notify: Parsing TTCN-3 module `SCCP_Emulation.ttcn'...
SCCP_Emulation.ttcn:1828.40: warning: Keyword 'class' is treated as an identifier. Activate compiler option '-k' to use object-oriented features.
SCCP_Emulation.ttcn:2237.44-52: warning: Keyword 'class' is treated as an identifier. Activate compiler option '-k' to use object-oriented features.
SCCP_Emulation.ttcn:2270.44-52: warning: Keyword 'class' is treated as an identifier. Activate compiler option '-k' to use object-oriented features.
SCCP_Emulation.ttcn:3521.41-49: warning: Keyword 'class' is treated as an identifier. Activate compiler option '-k' to use object-oriented features.
SCCP_Emulation.ttcn:4915.44: warning: Keyword 'class' is treated as an identifier. Activate compiler option '-k' to use object-oriented features.
SCCP_Emulation.ttcn:5020.33-41: warning: Keyword 'class' is treated as an identifier. Activate compiler option '-k' to use object-oriented features.
SCCP_Emulation.ttcn:5347.9-20: warning: Keyword 'class' is treated as an identifier. Activate compiler option '-k' to use object-oriented features.
SCCP_Emulation.ttcn:5348.41-52: warning: Keyword 'class' is treated as an identifier. Activate compiler option '-k' to use object-oriented features.
SCCP_Emulation.ttcn:5350.41-52: warning: Keyword 'class' is treated as an identifier. Activate compiler option '-k' to use object-oriented features.
SCCP_Emulation.ttcn:5405.7-18: warning: Keyword 'class' is treated as an identifier. Activate compiler option '-k' to use object-oriented features.
SCCP_Emulation.ttcn:5407.7-18: warning: Keyword 'class' is treated as an identifier. Activate compiler option '-k' to use object-oriented features.
Notify: Parsing TTCN-3 module `SCCP_Templates.ttcn'...
SCCP_Templates.ttcn:85.44: warning: Keyword 'class' is treated as an identifier. Activate compiler option '-k' to use object-oriented features.
Notify: Parsing TTCN-3 module `SCCP_Types.ttcn'...
SCCP_Types.ttcn:522.5-8: warning: Keyword 'class' is treated as an identifier. Activate compiler option '-k' to use object-oriented features.
SCCP_Types.ttcn:702.5-8: warning: Keyword 'class' is treated as an identifier. Activate compiler option '-k' to use object-oriented features.
Notify: Parsing TTCN-3 module `SCCPasp_Types.ttcn'...
Notify: Parsing TTCN-3 module `SCTPasp_PortType.ttcn'...
Notify: Parsing TTCN-3 module `SCTPasp_Types.ttcn'...
Notify: Parsing TTCN-3 module `SGSN_Tests.ttcn'...
Notify: Parsing TTCN-3 module `SGSN_Tests_Iu.ttcn'...
Notify: Parsing TTCN-3 module `SGSN_Tests_NS.ttcn'...
Notify: Parsing TTCN-3 module `SNDCP_Types.ttcn'...
Notify: Parsing TTCN-3 module `Socket_API_Definitions.ttcn'...
Notify: Parsing TTCN-3 module `TCCConversion_Functions.ttcn'...
Notify: Parsing TTCN-3 module `TCCInterface_Functions.ttcn'...
Notify: Parsing TTCN-3 module `TELNETasp_PortType.ttcn'...
Notify: Parsing TTCN-3 module `BSSGP_Emulation.ttcn'...
Notify: Parsing TTCN-3 module `IPA_Emulation.ttcn'...
Notify: Parsing TTCN-3 module `NS_Emulation.ttcn'...
Notify: Parsing TTCN-3 module `RAN_Adapter.ttcn'...
Notify: Parsing TTCN-3 module `RAN_Emulation.ttcn'...
Notify: Parsing TTCN-3 module `RAW_NS.ttcn'...
Notify: Parsing TTCN-3 module `SCCP_Mapping.ttcn'...
Notify: Parsing ASN.1 module `RANAP_CommonDataTypes.asn'...
RANAP_CommonDataTypes.asn:23: warning: Missing IMPORTS clause is interpreted as `IMPORTS ;' (import nothing) instead of importing all symbols from all modules.
Notify: Parsing ASN.1 module `RANAP_Constants.asn'...
RANAP_Constants.asn:28: warning: Missing IMPORTS clause is interpreted as `IMPORTS ;' (import nothing) instead of importing all symbols from all modules.
Notify: Parsing ASN.1 module `RANAP_Containers.asn'...
Notify: Parsing ASN.1 module `RANAP_IEs.asn'...
Notify: Parsing ASN.1 module `RANAP_PDU_Contents.asn'...
Notify: Parsing ASN.1 module `RANAP_PDU_Descriptions.asn'...
Notify: Checking modules...
NS_Provider_IPL4.ttcn: In TTCN-3 module `NS_Provider_IPL4':
 NS_Provider_IPL4.ttcn:28.1-28: In import definition:
  NS_Provider_IPL4.ttcn: warning: Circular import chain is not recommended: `@NS_Provider_IPL4' -> `@NS_Emulation' -> `@NS_Provider_IPL4'
 NS_Provider_IPL4.ttcn:29.1-28: In import definition:
  NS_Provider_IPL4.ttcn: warning: Circular import chain is not recommended: `@NS_Provider_IPL4' -> `@NS_Emulation' -> `@NS_Provider_IPL4'
 NS_Provider_IPL4.ttcn:30.1-22: In import definition:
  NS_Provider_IPL4.ttcn: warning: Circular import chain is not recommended: `@NS_Provider_IPL4' -> `@NS_Emulation' -> `@NS_Provider_IPL4'
 NS_Provider_IPL4.ttcn:31.1-24: In import definition:
  NS_Provider_IPL4.ttcn: warning: Circular import chain is not recommended: `@NS_Provider_IPL4' -> `@NS_Emulation' -> `@NS_Provider_IPL4'
 NS_Provider_IPL4.ttcn:33.1-29: In import definition:
  NS_Provider_IPL4.ttcn: warning: Circular import chain is not recommended: `@NS_Provider_IPL4' -> `@NS_Emulation' -> `@NS_Provider_IPL4'
 NS_Provider_IPL4.ttcn:34.1-32: In import definition:
  NS_Provider_IPL4.ttcn: warning: Circular import chain is not recommended: `@NS_Provider_IPL4' -> `@NS_Emulation' -> `@NS_Provider_IPL4'
RAN_Adapter.ttcn: In TTCN-3 module `RAN_Adapter':
 RAN_Adapter.ttcnpp:40.1-54.1: warning: Definition with name `RAN_Adapter' hides a module identifier
GSUP_Templates.ttcn: In TTCN-3 module `GSUP_Templates':
 GSUP_Templates.ttcn:371.1-372.58: In template definition `tr_GSUP_SAI_REQ':
  GSUP_Templates.ttcn:372.14-58: In actual parameter list of template `@GSUP_Templates.tr_GSUP_IMSI':
   GSUP_Templates.ttcn:372.54-57: In parameter #2 for `imsi':
    GSUP_Templates.ttcn:372.54-57: warning: Inadequate restriction on the referenced template parameter `imsi', this may cause a dynamic test case error at runtime
    GSUP_Templates.ttcn:371.35-57: note: Referenced template parameter is here
 GSUP_Templates.ttcn:374.1-383.5: In template definition `tr_GSUP_SAI_REQ_UMTS_AKA_RESYNC':
  GSUP_Templates.ttcn:378.9-383.5: In actual parameter list of template `@GSUP_Templates.tr_GSUP':
   GSUP_Templates.ttcn:378.49-383.4: In parameter #2 for `ies':
    GSUP_Templates.ttcn:379.4-24: In component 1:
     GSUP_Templates.ttcn:379.19-24: In actual parameter list of template `@GSUP_Templates.tr_GSUP_IE_IMSI':
      GSUP_Templates.ttcn:379.20-23: In parameter #1 for `imsi':
       GSUP_Templates.ttcn:379.20-23: warning: Inadequate restriction on the referenced template parameter `imsi', this may cause a dynamic test case error at runtime
       GSUP_Templates.ttcn:375.3-25: note: Referenced template parameter is here
 GSUP_Templates.ttcn:389.1-391.54: In template definition `tr_GSUP_SAI_ERR':
  GSUP_Templates.ttcn:390.9-391.54: In actual parameter list of template `@GSUP_Templates.tr_GSUP':
   GSUP_Templates.ttcn:390.47-391.53: In parameter #2 for `ies':
    GSUP_Templates.ttcn:391.4-24: In component 1:
     GSUP_Templates.ttcn:391.19-24: In actual parameter list of template `@GSUP_Templates.tr_GSUP_IE_IMSI':
      GSUP_Templates.ttcn:391.20-23: In parameter #1 for `imsi':
       GSUP_Templates.ttcn:391.20-23: warning: Inadequate restriction on the referenced template parameter `imsi', this may cause a dynamic test case error at runtime
       GSUP_Templates.ttcn:389.35-57: note: Referenced template parameter is here
 GSUP_Templates.ttcn:403.1-406.41: In template definition `ts_GSUP_UL_REQ':
  GSUP_Templates.ttcn:405.9-406.41: In actual parameter list of template `@GSUP_Templates.ts_GSUP':
   GSUP_Templates.ttcn:405.50-406.40: In parameter #2 for `ies':
    GSUP_Templates.ttcn:405.62-406.40: In actual parameter list of function `@GSUP_Templates.f_gen_ts_ies':
     In parameter #7 for `source_name':
      GSUP_Templates.ttcn:406.29-39: warning: Inadequate restriction on the referenced template parameter `source_name', this may cause a dynamic test case error at runtime
      GSUP_Templates.ttcn:404.7-46: note: Referenced template parameter is here
 GSUP_Templates.ttcn:408.1-409.59: In template definition `tr_GSUP_UL_REQ':
  GSUP_Templates.ttcn:409.14-59: In actual parameter list of template `@GSUP_Templates.tr_GSUP_IMSI':
   GSUP_Templates.ttcn:409.55-58: In parameter #2 for `imsi':
    GSUP_Templates.ttcn:409.55-58: warning: Inadequate restriction on the referenced template parameter `imsi', this may cause a dynamic test case error at runtime
    GSUP_Templates.ttcn:408.34-56: note: Referenced template parameter is here
 GSUP_Templates.ttcn:415.1-416.105: In template definition `tr_GSUP_UL_RES':
  GSUP_Templates.ttcn:416.9-105: In actual parameter list of template `@GSUP_Templates.tr_GSUP':
   GSUP_Templates.ttcn:416.49-104: In parameter #2 for `ies':
    GSUP_Templates.ttcn:1246.9-1327.1: In function definition `f_gen_tr_ies':
     GSUP_Templates.ttcn:1259.24-1261.2: In template variable definition `ies':
      GSUP_Templates.ttcn:1260.3-23: In component 1:
       GSUP_Templates.ttcn:1260.18-23: In actual parameter list of template `@GSUP_Templates.tr_GSUP_IE_IMSI':
        GSUP_Templates.ttcn:1260.19-22: In parameter #1 for `imsi':
         GSUP_Templates.ttcn:1260.19-22: warning: Inadequate restriction on the referenced template parameter `imsi', this may cause a dynamic test case error at runtime
         GSUP_Templates.ttcn:1246.31-53: note: Referenced template parameter is here
     GSUP_Templates.ttcn:1284.2-1287.2: In if statement:
      GSUP_Templates.ttcn:1285.3-45: In variable assignment:
       GSUP_Templates.ttcn:1285.36-45: In actual parameter list of template `@GSUP_Templates.tr_GSUP_IE_PdpInfo_ie':
        GSUP_Templates.ttcn:1285.37-44: In parameter #1 for `pdp_info':
         GSUP_Templates.ttcn:1285.37-44: warning: Inadequate restriction on the referenced template parameter `pdp_info', this may cause a dynamic test case error at runtime
         GSUP_Templates.ttcn:1248.10-43: note: Referenced template parameter is here
     GSUP_Templates.ttcn:1304.2-1307.2: In if statement:
      GSUP_Templates.ttcn:1305.3-33: In variable assignment:
       GSUP_Templates.ttcn:1305.29-33: In actual parameter list of template `@GSUP_Templates.tr_GSUP_IE_PCO':
        GSUP_Templates.ttcn:1305.30-32: In parameter #1 for `pco':
         GSUP_Templates.ttcn:1305.30-32: warning: Inadequate restriction on the referenced template parameter `pco', this may cause a dynamic test case error at runtime
         GSUP_Templates.ttcn:1254.10-38: note: Referenced template parameter is here
 GSUP_Templates.ttcn:437.1-442.67: In template definition `ts_GSUP_ISD_RES':
  GSUP_Templates.ttcn:440.9-442.67: In actual parameter list of template `@GSUP_Templates.ts_GSUP':
   GSUP_Templates.ttcn:441.17-442.66: In parameter #2 for `ies':
    GSUP_Templates.ttcn:441.29-442.66: In actual parameter list of function `@GSUP_Templates.f_gen_ts_ies':
     In parameter #7 for `source_name':
      GSUP_Templates.ttcn:441.51-61: warning: Inadequate restriction on the referenced template parameter `source_name', this may cause a dynamic test case error at runtime
      GSUP_Templates.ttcn:438.35-74: note: Referenced template parameter is here
     In parameter #8 for `destination_name':
      GSUP_Templates.ttcn:442.50-65: warning: Inadequate restriction on the referenced template parameter `destination_name', this may cause a dynamic test case error at runtime
      GSUP_Templates.ttcn:439.35-79: note: Referenced template parameter is here
 GSUP_Templates.ttcn:444.1-445.54: In template definition `tr_GSUP_ISD_RES':
  GSUP_Templates.ttcn:445.14-54: In actual parameter list of template `@GSUP_Templates.tr_GSUP_IMSI':
   GSUP_Templates.ttcn:445.50-53: In parameter #2 for `imsi':
    GSUP_Templates.ttcn:445.50-53: warning: Inadequate restriction on the referenced template parameter `imsi', this may cause a dynamic test case error at runtime
    GSUP_Templates.ttcn:444.35-57: note: Referenced template parameter is here
 GSUP_Templates.ttcn:462.1-463.58: In template definition `tr_GSUP_CL_RES':
  GSUP_Templates.ttcn:463.14-58: In actual parameter list of template `@GSUP_Templates.tr_GSUP_IMSI':
   GSUP_Templates.ttcn:463.54-57: In parameter #2 for `imsi':
    GSUP_Templates.ttcn:463.54-57: warning: Inadequate restriction on the referenced template parameter `imsi', this may cause a dynamic test case error at runtime
    GSUP_Templates.ttcn:462.34-56: note: Referenced template parameter is here
 GSUP_Templates.ttcn:468.1-470.55: In template definition `tr_GSUP_CL_ERR':
  GSUP_Templates.ttcn:469.9-470.55: In actual parameter list of template `@GSUP_Templates.tr_GSUP':
   GSUP_Templates.ttcn:469.48-470.54: In parameter #2 for `ies':
    GSUP_Templates.ttcn:470.4-24: In component 1:
     GSUP_Templates.ttcn:470.19-24: In actual parameter list of template `@GSUP_Templates.tr_GSUP_IE_IMSI':
      GSUP_Templates.ttcn:470.20-23: In parameter #1 for `imsi':
       GSUP_Templates.ttcn:470.20-23: warning: Inadequate restriction on the referenced template parameter `imsi', this may cause a dynamic test case error at runtime
       GSUP_Templates.ttcn:468.34-56: note: Referenced template parameter is here
 GSUP_Templates.ttcn:476.1-478.56: In template definition `tr_GSUP_PURGE_MS_REQ':
  GSUP_Templates.ttcn:477.9-478.56: In actual parameter list of template `@GSUP_Templates.tr_GSUP':
   GSUP_Templates.ttcn:477.43-478.55: In parameter #2 for `ies':
    GSUP_Templates.ttcn:478.4-24: In component 1:
     GSUP_Templates.ttcn:478.19-24: In actual parameter list of template `@GSUP_Templates.tr_GSUP_IE_IMSI':
      GSUP_Templates.ttcn:478.20-23: In parameter #1 for `imsi':
       GSUP_Templates.ttcn:478.20-23: warning: Inadequate restriction on the referenced template parameter `imsi', this may cause a dynamic test case error at runtime
       GSUP_Templates.ttcn:476.40-62: note: Referenced template parameter is here
 GSUP_Templates.ttcn:484.1-486.29: In template definition `tr_GSUP_PURGE_MS_RES':
  GSUP_Templates.ttcn:485.9-486.29: In actual parameter list of template `@GSUP_Templates.tr_GSUP':
   GSUP_Templates.ttcn:485.42-486.28: In parameter #2 for `ies':
    GSUP_Templates.ttcn:486.3-23: In component 1:
     GSUP_Templates.ttcn:486.18-23: In actual parameter list of template `@GSUP_Templates.tr_GSUP_IE_IMSI':
      GSUP_Templates.ttcn:486.19-22: In parameter #1 for `imsi':
       GSUP_Templates.ttcn:486.19-22: warning: Inadequate restriction on the referenced template parameter `imsi', this may cause a dynamic test case error at runtime
       GSUP_Templates.ttcn:484.40-62: note: Referenced template parameter is here
 GSUP_Templates.ttcn:488.1-490.51: In template definition `tr_GSUP_PURGE_MS_ERR':
  GSUP_Templates.ttcn:489.9-490.51: In actual parameter list of template `@GSUP_Templates.tr_GSUP':
   GSUP_Templates.ttcn:489.41-490.50: In parameter #2 for `ies':
    GSUP_Templates.ttcn:490.3-23: In component 1:
     GSUP_Templates.ttcn:490.18-23: In actual parameter list of template `@GSUP_Templates.tr_GSUP_IE_IMSI':
      GSUP_Templates.ttcn:490.19-22: In parameter #1 for `imsi':
       GSUP_Templates.ttcn:490.19-22: warning: Inadequate restriction on the referenced template parameter `imsi', this may cause a dynamic test case error at runtime
       GSUP_Templates.ttcn:488.40-62: note: Referenced template parameter is here
 GSUP_Templates.ttcn:496.1-506.1: In template definition `tr_GSUP_CHECK_IMEI_REQ':
  GSUP_Templates.ttcn:499.13-506.1: In actual parameter list of template `@GSUP_Templates.tr_GSUP':
   GSUP_Templates.ttcn:501.2-505.2: In parameter #2 for `ies':
    GSUP_Templates.ttcn:502.3-23: In component 1:
     GSUP_Templates.ttcn:502.18-23: In actual parameter list of template `@GSUP_Templates.tr_GSUP_IE_IMSI':
      GSUP_Templates.ttcn:502.19-22: In parameter #1 for `imsi':
       GSUP_Templates.ttcn:502.19-22: warning: Inadequate restriction on the referenced template parameter `imsi', this may cause a dynamic test case error at runtime
       GSUP_Templates.ttcn:497.2-24: note: Referenced template parameter is here
 GSUP_Templates.ttcn:1362.9-1410.1: In function definition `f_gen_tr_ss_ies':
  GSUP_Templates.ttcn:1371.24-1373.2: In template variable definition `ies':
   GSUP_Templates.ttcn:1372.3-23: In component 1:
    GSUP_Templates.ttcn:1372.18-23: In actual parameter list of template `@GSUP_Templates.tr_GSUP_IE_IMSI':
     GSUP_Templates.ttcn:1372.19-22: In parameter #1 for `imsi':
      GSUP_Templates.ttcn:1372.19-22: warning: Inadequate restriction on the referenced template parameter `imsi', this may cause a dynamic test case error at runtime
      GSUP_Templates.ttcn:1363.2-24: note: Referenced template parameter is here
 GSUP_Templates.ttcn:1488.1-1505.1: In template definition `tr_GSUP_MO_FORWARD_SM_REQ':
  GSUP_Templates.ttcn:1494.13-1505.1: In actual parameter list of template `@GSUP_Templates.tr_GSUP':
   GSUP_Templates.ttcn:1496.2-1504.2: In parameter #2 for `ies':
    GSUP_Templates.ttcn:1497.3-23: In component 1:
     GSUP_Templates.ttcn:1497.18-23: In actual parameter list of template `@GSUP_Templates.tr_GSUP_IE_IMSI':
      GSUP_Templates.ttcn:1497.19-22: In parameter #1 for `imsi':
       GSUP_Templates.ttcn:1497.19-22: warning: Inadequate restriction on the referenced template parameter `imsi', this may cause a dynamic test case error at runtime
       GSUP_Templates.ttcn:1489.2-29: note: Referenced template parameter is here
 GSUP_Templates.ttcn:1518.1-1529.1: In template definition `tr_GSUP_MO_FORWARD_SM_RES':
  GSUP_Templates.ttcn:1521.13-1529.1: In actual parameter list of template `@GSUP_Templates.tr_GSUP':
   GSUP_Templates.ttcn:1523.2-1528.2: In parameter #2 for `ies':
    GSUP_Templates.ttcn:1524.3-23: In component 1:
     GSUP_Templates.ttcn:1524.18-23: In actual parameter list of template `@GSUP_Templates.tr_GSUP_IE_IMSI':
      GSUP_Templates.ttcn:1524.19-22: In parameter #1 for `imsi':
       GSUP_Templates.ttcn:1524.19-22: warning: Inadequate restriction on the referenced template parameter `imsi', this may cause a dynamic test case error at runtime
       GSUP_Templates.ttcn:1519.2-29: note: Referenced template parameter is here
 GSUP_Templates.ttcn:1544.1-1557.1: In template definition `tr_GSUP_MO_FORWARD_SM_ERR':
  GSUP_Templates.ttcn:1548.13-1557.1: In actual parameter list of template `@GSUP_Templates.tr_GSUP':
   GSUP_Templates.ttcn:1550.2-1556.2: In parameter #2 for `ies':
    GSUP_Templates.ttcn:1551.3-23: In component 1:
     GSUP_Templates.ttcn:1551.18-23: In actual parameter list of template `@GSUP_Templates.tr_GSUP_IE_IMSI':
      GSUP_Templates.ttcn:1551.19-22: In parameter #1 for `imsi':
       GSUP_Templates.ttcn:1551.19-22: warning: Inadequate restriction on the referenced template parameter `imsi', this may cause a dynamic test case error at runtime
       GSUP_Templates.ttcn:1545.2-29: note: Referenced template parameter is here
 GSUP_Templates.ttcn:1583.1-1607.1: In template definition `tr_GSUP_MT_FORWARD_SM_REQ':
  GSUP_Templates.ttcn:1590.13-1607.1: In actual parameter list of template `@GSUP_Templates.tr_GSUP':
   GSUP_Templates.ttcn:1592.2-1606.2: In parameter #2 for `ies':
    GSUP_Templates.ttcn:1598.3-23: In component 1:
     GSUP_Templates.ttcn:1598.18-23: In actual parameter list of template `@GSUP_Templates.tr_GSUP_IE_IMSI':
      GSUP_Templates.ttcn:1598.19-22: In parameter #1 for `imsi':
       GSUP_Templates.ttcn:1598.19-22: warning: Inadequate restriction on the referenced template parameter `imsi', this may cause a dynamic test case error at runtime
       GSUP_Templates.ttcn:1584.2-29: note: Referenced template parameter is here
 GSUP_Templates.ttcn:1620.1-1631.1: In template definition `tr_GSUP_MT_FORWARD_SM_RES':
  GSUP_Templates.ttcn:1623.13-1631.1: In actual parameter list of template `@GSUP_Templates.tr_GSUP':
   GSUP_Templates.ttcn:1625.2-1630.2: In parameter #2 for `ies':
    GSUP_Templates.ttcn:1626.3-23: In component 1:
     GSUP_Templates.ttcn:1626.18-23: In actual parameter list of template `@GSUP_Templates.tr_GSUP_IE_IMSI':
      GSUP_Templates.ttcn:1626.19-22: In parameter #1 for `imsi':
       GSUP_Templates.ttcn:1626.19-22: warning: Inadequate restriction on the referenced template parameter `imsi', this may cause a dynamic test case error at runtime
       GSUP_Templates.ttcn:1621.2-29: note: Referenced template parameter is here
 GSUP_Templates.ttcn:1646.1-1659.1: In template definition `tr_GSUP_MT_FORWARD_SM_ERR':
  GSUP_Templates.ttcn:1650.13-1659.1: In actual parameter list of template `@GSUP_Templates.tr_GSUP':
   GSUP_Templates.ttcn:1652.2-1658.2: In parameter #2 for `ies':
    GSUP_Templates.ttcn:1653.3-23: In component 1:
     GSUP_Templates.ttcn:1653.18-23: In actual parameter list of template `@GSUP_Templates.tr_GSUP_IE_IMSI':
      GSUP_Templates.ttcn:1653.19-22: In parameter #1 for `imsi':
       GSUP_Templates.ttcn:1653.19-22: warning: Inadequate restriction on the referenced template parameter `imsi', this may cause a dynamic test case error at runtime
       GSUP_Templates.ttcn:1647.2-29: note: Referenced template parameter is here
 GSUP_Templates.ttcn:1674.1-1687.1: In template definition `tr_GSUP_MO_READY_FOR_SM_REQ':
  GSUP_Templates.ttcn:1678.13-1687.1: In actual parameter list of template `@GSUP_Templates.tr_GSUP':
   GSUP_Templates.ttcn:1680.2-1686.2: In parameter #2 for `ies':
    GSUP_Templates.ttcn:1681.3-23: In component 1:
     GSUP_Templates.ttcn:1681.18-23: In actual parameter list of template `@GSUP_Templates.tr_GSUP_IE_IMSI':
      GSUP_Templates.ttcn:1681.19-22: In parameter #1 for `imsi':
       GSUP_Templates.ttcn:1681.19-22: warning: Inadequate restriction on the referenced template parameter `imsi', this may cause a dynamic test case error at runtime
       GSUP_Templates.ttcn:1675.2-29: note: Referenced template parameter is here
 GSUP_Templates.ttcn:1700.1-1711.1: In template definition `tr_GSUP_MO_READY_FOR_SM_RES':
  GSUP_Templates.ttcn:1703.13-1711.1: In actual parameter list of template `@GSUP_Templates.tr_GSUP':
   GSUP_Templates.ttcn:1705.2-1710.2: In parameter #2 for `ies':
    GSUP_Templates.ttcn:1706.3-23: In component 1:
     GSUP_Templates.ttcn:1706.18-23: In actual parameter list of template `@GSUP_Templates.tr_GSUP_IE_IMSI':
      GSUP_Templates.ttcn:1706.19-22: In parameter #1 for `imsi':
       GSUP_Templates.ttcn:1706.19-22: warning: Inadequate restriction on the referenced template parameter `imsi', this may cause a dynamic test case error at runtime
       GSUP_Templates.ttcn:1701.2-29: note: Referenced template parameter is here
 GSUP_Templates.ttcn:1726.1-1739.1: In template definition `tr_GSUP_MO_READY_FOR_SM_ERR':
  GSUP_Templates.ttcn:1730.13-1739.1: In actual parameter list of template `@GSUP_Templates.tr_GSUP':
   GSUP_Templates.ttcn:1732.2-1738.2: In parameter #2 for `ies':
    GSUP_Templates.ttcn:1733.3-23: In component 1:
     GSUP_Templates.ttcn:1733.18-23: In actual parameter list of template `@GSUP_Templates.tr_GSUP_IE_IMSI':
      GSUP_Templates.ttcn:1733.19-22: In parameter #1 for `imsi':
       GSUP_Templates.ttcn:1733.19-22: warning: Inadequate restriction on the referenced template parameter `imsi', this may cause a dynamic test case error at runtime
       GSUP_Templates.ttcn:1727.2-29: note: Referenced template parameter is here
 GSUP_Templates.ttcn:1778.1-1793.1: In template definition `tr_GSUP_E_AN_APDU':
  GSUP_Templates.ttcn:1784.13-1793.1: In actual parameter list of template `@GSUP_Templates.tr_GSUP':
   GSUP_Templates.ttcn:1786.2-1792.2: In parameter #2 for `ies':
    GSUP_Templates.ttcn:1787.3-23: In component 1:
     GSUP_Templates.ttcn:1787.18-23: In actual parameter list of template `@GSUP_Templates.tr_GSUP_IE_IMSI':
      GSUP_Templates.ttcn:1787.19-22: In parameter #1 for `imsi':
       GSUP_Templates.ttcn:1787.19-22: warning: Inadequate restriction on the referenced template parameter `imsi', this may cause a dynamic test case error at runtime
       GSUP_Templates.ttcn:1780.2-29: note: Referenced template parameter is here
 GSUP_Templates.ttcn:1795.1-1808.1: In template definition `tr_GSUP_E_NO_PDU':
  GSUP_Templates.ttcn:1800.13-1808.1: In actual parameter list of template `@GSUP_Templates.tr_GSUP':
   GSUP_Templates.ttcn:1802.2-1807.2: In parameter #2 for `ies':
    GSUP_Templates.ttcn:1803.3-23: In component 1:
     GSUP_Templates.ttcn:1803.18-23: In actual parameter list of template `@GSUP_Templates.tr_GSUP_IE_IMSI':
      GSUP_Templates.ttcn:1803.19-22: In parameter #1 for `imsi':
       GSUP_Templates.ttcn:1803.19-22: warning: Inadequate restriction on the referenced template parameter `imsi', this may cause a dynamic test case error at runtime
       GSUP_Templates.ttcn:1797.2-29: note: Referenced template parameter is here
GSUP_Emulation.ttcn: In TTCN-3 module `GSUP_Emulation':
 GSUP_Emulation.ttcn:267.1-292.1: In function definition `ExpectedCreateCallback':
  GSUP_Emulation.ttcn:291.2-11: warning: Control never reaches this statement
GTPv1C_Templates.ttcn: In TTCN-3 module `GTPv1C_Templates':
 GTPv1C_Templates.ttcn:75.2-78.2: In template definition `ts_Cause_gtpc':
  GTPv1C_Templates.ttcn:75.2-78.2: While checking template restriction `value':
   GTPv1C_Templates.ttcn:77.17-48: warning: Inadequate restriction on the referenced function `enum2oct1_Cause_gtpc_tmpl(cause)', this may cause a dynamic test case error at runtime
   GTPv1C_Templates.ttcn:79.10-90.2: note: Referenced function is here
 GTPv1C_Templates.ttcn:95.2-104.2: In function definition `f_tr_Cause_gtpc':
  GTPv1C_Templates.ttcn:101.5-103.3: In else statement:
   GTPv1C_Templates.ttcn:102.4-30: In return statement:
    GTPv1C_Templates.ttcn:102.24-30: In actual parameter list of template `@GTPv1C_Templates.tr_Cause_gtpc':
     GTPv1C_Templates.ttcn:102.25-29: In parameter #1 for `cause':
      GTPv1C_Templates.ttcn:102.25-29: warning: Inadequate restriction on the referenced template parameter `cause', this may cause a dynamic test case error at runtime
      GTPv1C_Templates.ttcn:95.27-50: note: Referenced template parameter is here
 GTPv1C_Templates.ttcn:207.2-215.2: In function definition `f_tr_MS_Validated':
  GTPv1C_Templates.ttcn:212.5-214.3: In else statement:
   GTPv1C_Templates.ttcn:213.4-38: In return statement:
    GTPv1C_Templates.ttcn:213.26-38: In actual parameter list of template `@GTPv1C_Templates.tr_MS_Validated':
     GTPv1C_Templates.ttcn:213.27-37: In parameter #1 for `msValidated':
      GTPv1C_Templates.ttcn:213.27-37: warning: Inadequate restriction on the referenced template parameter `msValidated', this may cause a dynamic test case error at runtime
      GTPv1C_Templates.ttcn:207.29-58: note: Referenced template parameter is here
 GTPv1C_Templates.ttcn:216.10-222.2: In function definition `f_ts_MS_Validated':
  GTPv1C_Templates.ttcn:221.3-37: In return statement:
   GTPv1C_Templates.ttcn:221.25-37: In actual parameter list of template `@GTPv1C_Templates.ts_MS_Validated':
    GTPv1C_Templates.ttcn:221.26-36: In parameter #1 for `msValidated':
     GTPv1C_Templates.ttcn:221.26-36: warning: Inadequate restriction on the referenced template parameter `msValidated', this may cause a dynamic test case error at runtime
     GTPv1C_Templates.ttcn:216.37-68: note: Referenced template parameter is here
 GTPv1C_Templates.ttcn:243.10-249.2: In function definition `f_ts_TEIC':
  GTPv1C_Templates.ttcn:248.3-22: In return statement:
   GTPv1C_Templates.ttcn:248.17-22: In actual parameter list of template `@GTPv1C_Templates.ts_TEIC':
    GTPv1C_Templates.ttcn:248.18-21: In parameter #1 for `teic':
     GTPv1C_Templates.ttcn:248.18-21: warning: Inadequate restriction on the referenced template parameter `teic', this may cause a dynamic test case error at runtime
     GTPv1C_Templates.ttcn:243.29-53: note: Referenced template parameter is here
 GTPv1C_Templates.ttcn:273.10-279.2: In function definition `f_ts_IMEISV':
  GTPv1C_Templates.ttcn:278.3-26: In return statement:
   GTPv1C_Templates.ttcn:278.19-26: In actual parameter list of template `@GTPv1C_Templates.ts_IMEISV':
    GTPv1C_Templates.ttcn:278.20-25: In parameter #1 for `imeisv':
     GTPv1C_Templates.ttcn:278.20-25: warning: Inadequate restriction on the referenced template parameter `imeisv', this may cause a dynamic test case error at runtime
     GTPv1C_Templates.ttcn:273.31-57: note: Referenced template parameter is here
 GTPv1C_Templates.ttcn:298.2-310.2: In function definition `f_ts_MS_TimeZone':
  GTPv1C_Templates.ttcn:303.3-305.3: In if statement:
   GTPv1C_Templates.ttcn:304.4-66: In return statement:
    GTPv1C_Templates.ttcn:304.25-66: In actual parameter list of template `@GTPv1C_Templates.ts_MS_TimeZone':
     In parameter #2 for `daylightSavingTime':
      GTPv1C_Templates.ttcn:304.48-65: warning: Inadequate restriction on the referenced template parameter `daylightSavingTime', this may cause a dynamic test case error at runtime
      GTPv1C_Templates.ttcn:298.59-97: note: Referenced template parameter is here
  GTPv1C_Templates.ttcn:306.3-308.3: In if statement:
   GTPv1C_Templates.ttcn:307.4-34: In return statement:
    GTPv1C_Templates.ttcn:307.25-34: In actual parameter list of template `@GTPv1C_Templates.ts_MS_TimeZone':
     GTPv1C_Templates.ttcn:307.26-33: In parameter #1 for `timeZone':
      GTPv1C_Templates.ttcn:307.26-33: warning: Inadequate restriction on the referenced template parameter `timeZone', this may cause a dynamic test case error at runtime
      GTPv1C_Templates.ttcn:298.28-56: note: Referenced template parameter is here
  GTPv1C_Templates.ttcn:309.3-53: In return statement:
   GTPv1C_Templates.ttcn:309.24-53: In actual parameter list of template `@GTPv1C_Templates.ts_MS_TimeZone':
    GTPv1C_Templates.ttcn:309.25-32: In parameter #1 for `timeZone':
     GTPv1C_Templates.ttcn:309.25-32: warning: Inadequate restriction on the referenced template parameter `timeZone', this may cause a dynamic test case error at runtime
     GTPv1C_Templates.ttcn:298.28-56: note: Referenced template parameter is here
    GTPv1C_Templates.ttcn:309.35-52: In parameter #2 for `daylightSavingTime':
     GTPv1C_Templates.ttcn:309.35-52: warning: Inadequate restriction on the referenced template parameter `daylightSavingTime', this may cause a dynamic test case error at runtime
     GTPv1C_Templates.ttcn:298.59-97: note: Referenced template parameter is here
 GTPv1C_Templates.ttcn:328.10-334.2: In function definition `f_ts_ChargingCharacteristics':
  GTPv1C_Templates.ttcn:333.3-49: In return statement:
   GTPv1C_Templates.ttcn:333.36-49: In actual parameter list of template `@GTPv1C_Templates.ts_ChargingCharacteristics':
    GTPv1C_Templates.ttcn:333.37-48: In parameter #1 for `chargingChar':
     GTPv1C_Templates.ttcn:333.37-48: warning: Inadequate restriction on the referenced template parameter `chargingChar', this may cause a dynamic test case error at runtime
     GTPv1C_Templates.ttcn:328.48-80: note: Referenced template parameter is here
 GTPv1C_Templates.ttcn:703.2-711.2: In function definition `f_tr_Imsi':
  GTPv1C_Templates.ttcn:708.5-710.3: In else statement:
   GTPv1C_Templates.ttcn:709.4-25: In return statement:
    GTPv1C_Templates.ttcn:709.18-25: In actual parameter list of template `@GTPv1C_Templates.tr_Imsi':
     GTPv1C_Templates.ttcn:709.19-24: In parameter #1 for `digits':
      GTPv1C_Templates.ttcn:709.19-24: warning: Inadequate restriction on the referenced template parameter `digits', this may cause a dynamic test case error at runtime
      GTPv1C_Templates.ttcn:703.21-50: note: Referenced template parameter is here
 GTPv1C_Templates.ttcn:728.2-734.2: In function definition `f_ts_RATType':
  GTPv1C_Templates.ttcn:731.5-733.3: In else statement:
   GTPv1C_Templates.ttcn:732.4-30: In return statement:
    GTPv1C_Templates.ttcn:732.21-30: In actual parameter list of template `@GTPv1C_Templates.ts_RATType':
     GTPv1C_Templates.ttcn:732.22-29: In parameter #1 for `rat_type':
      GTPv1C_Templates.ttcn:732.22-29: warning: Inadequate restriction on the referenced template parameter `rat_type', this may cause a dynamic test case error at runtime
      GTPv1C_Templates.ttcn:728.24-60: note: Referenced template parameter is here
 GTPv1C_Templates.ttcn:740.2-748.2: In function definition `f_tr_RATType':
  GTPv1C_Templates.ttcn:745.5-747.3: In else statement:
   GTPv1C_Templates.ttcn:746.4-30: In return statement:
    GTPv1C_Templates.ttcn:746.21-30: In actual parameter list of template `@GTPv1C_Templates.tr_RATType':
     GTPv1C_Templates.ttcn:746.22-29: In parameter #1 for `rat_type':
      GTPv1C_Templates.ttcn:746.22-29: warning: Inadequate restriction on the referenced template parameter `rat_type', this may cause a dynamic test case error at runtime
      GTPv1C_Templates.ttcn:740.24-50: note: Referenced template parameter is here
 GTPv1C_Templates.ttcn:1027.2-1035.2: In template definition `ts_PCO_IPv4_DNS_IPCP':
  GTPv1C_Templates.ttcn:1028.16-1034.3: In template for record field `protocols':
   GTPv1C_Templates.ttcn:1032.4-1033.62: In component 2:
    GTPv1C_Templates.ttcn:1033.9-60: In template for record field `protoIDContents':
     GTPv1C_Templates.ttcn:1033.23-60: In actual parameter list of external function `@IPCP_Types.enc_IpcpPacket':
      GTPv1C_Templates.ttcn:1033.24-59: In parameter #1 for `inp':
       GTPv1C_Templates.ttcn:1033.24-59: In the operand of operation `valueof()':
        GTPv1C_Templates.ttcn:1145.2-1147.74: In template definition `ts_IPCP_ReqDNS':
         GTPv1C_Templates.ttcn:1146.10-1147.74: In actual parameter list of template `@GTPv1C_Templates.ts_IPCP':
          GTPv1C_Templates.ttcn:1147.4-73: In parameter #3 for `opts':
           GTPv1C_Templates.ttcn:1126.11-14: warning: Inadequate restriction on the referenced template parameter `addr', this may cause a dynamic test case error at runtime
           GTPv1C_Templates.ttcn:1123.51-78: note: Referenced template parameter is here
           GTPv1C_Templates.ttcn:1131.11-14: warning: Inadequate restriction on the referenced template parameter `addr', this may cause a dynamic test case error at runtime
           GTPv1C_Templates.ttcn:1128.53-80: note: Referenced template parameter is here
 GTPv1C_Templates.ttcn:1037.2-1045.2: In template definition `ts_PCO_IPv4_PRI_DNS_IPCP':
  GTPv1C_Templates.ttcn:1038.16-1044.3: In template for record field `protocols':
   GTPv1C_Templates.ttcn:1042.4-1043.57: In component 2:
    GTPv1C_Templates.ttcn:1043.9-55: In template for record field `protoIDContents':
     GTPv1C_Templates.ttcn:1043.23-55: In actual parameter list of external function `@IPCP_Types.enc_IpcpPacket':
      GTPv1C_Templates.ttcn:1043.24-54: In parameter #1 for `inp':
       GTPv1C_Templates.ttcn:1043.24-54: In the operand of operation `valueof()':
        GTPv1C_Templates.ttcn:1149.2-1151.39: In template definition `ts_IPCP_ReqDNS_Primary':
         GTPv1C_Templates.ttcn:1150.10-1151.39: In actual parameter list of template `@GTPv1C_Templates.ts_IPCP':
          GTPv1C_Templates.ttcn:1151.4-38: In parameter #3 for `opts':
           GTPv1C_Templates.ttcn:1126.11-14: warning: Inadequate restriction on the referenced template parameter `addr', this may cause a dynamic test case error at runtime
           GTPv1C_Templates.ttcn:1123.51-78: note: Referenced template parameter is here
 GTPv1C_Templates.ttcn:1046.2-1054.2: In template definition `ts_PCO_IPv4_SEC_DNS_IPCP':
  GTPv1C_Templates.ttcn:1047.16-1053.3: In template for record field `protocols':
   GTPv1C_Templates.ttcn:1051.4-1052.59: In component 2:
    GTPv1C_Templates.ttcn:1052.9-57: In template for record field `protoIDContents':
     GTPv1C_Templates.ttcn:1052.23-57: In actual parameter list of external function `@IPCP_Types.enc_IpcpPacket':
      GTPv1C_Templates.ttcn:1052.24-56: In parameter #1 for `inp':
       GTPv1C_Templates.ttcn:1052.24-56: In the operand of operation `valueof()':
        GTPv1C_Templates.ttcn:1152.2-1154.41: In template definition `ts_IPCP_ReqDNS_Secondary':
         GTPv1C_Templates.ttcn:1153.10-1154.41: In actual parameter list of template `@GTPv1C_Templates.ts_IPCP':
          GTPv1C_Templates.ttcn:1154.4-40: In parameter #3 for `opts':
           GTPv1C_Templates.ttcn:1131.11-14: warning: Inadequate restriction on the referenced template parameter `addr', this may cause a dynamic test case error at runtime
           GTPv1C_Templates.ttcn:1128.53-80: note: Referenced template parameter is here
 GTPv1C_Templates.ttcn:1100.2-1114.2: In function definition `f_PCO_extract_proto':
  GTPv1C_Templates.ttcn:1113.3-12: warning: Control never reaches this statement
 GTPv1C_Templates.ttcn:1321.2-1358.2: In template definition `ts_SGSNContextRespPDU':
  GTPv1C_Templates.ttcn:1327.27-1357.3: In template for union field `sgsn_ContextResponse':
   GTPv1C_Templates.ttcn:1338.30-58: In template for record field `sgsn_addr_controlPlane':
    GTPv1C_Templates.ttcn:1338.40-58: In actual parameter list of template `@GTPv1C_Templates.ts_GsnAddr':
     GTPv1C_Templates.ttcn:1338.41-57: In parameter #1 for `ip_addr':
      GTPv1C_Templates.ttcn:1338.41-57: warning: Inadequate restriction on the referenced template parameter `sgsn_addr_control', this may cause a dynamic test case error at runtime
      GTPv1C_Templates.ttcn:1324.8-60: note: Referenced template parameter is here
  GTPv1C_Templates.ttcn:1321.2-1358.2: While checking template restriction `value':
   GTPv1C_Templates.ttcn:77.17-48: warning: Inadequate restriction on the referenced function `enum2oct1_Cause_gtpc_tmpl(cause)', this may cause a dynamic test case error at runtime
   GTPv1C_Templates.ttcn:79.10-90.2: note: Referenced function is here
 GTPv1C_Templates.ttcn:1381.2-1390.2: In template definition `ts_SGSNContextAckPDU':
  GTPv1C_Templates.ttcn:1381.2-1390.2: While checking template restriction `value':
   GTPv1C_Templates.ttcn:77.17-48: warning: Inadequate restriction on the referenced function `enum2oct1_Cause_gtpc_tmpl(cause)', this may cause a dynamic test case error at runtime
   GTPv1C_Templates.ttcn:79.10-90.2: note: Referenced function is here
 GTPv1C_Templates.ttcn:1392.2-1396.2: In template definition `ts_GTPC_SGSNContextAck':
  GTPv1C_Templates.ttcn:1392.55-1393.82: In formal parameter list:
   GTPv1C_Templates.ttcn:1393.14-81: In parameter `SGSNContextAckPDU':
    GTPv1C_Templates.ttcn:1393.62-81: In default value:
     GTPv1C_Templates.ttcn:77.17-48: warning: Inadequate restriction on the referenced function `enum2oct1_Cause_gtpc_tmpl(cause)', this may cause a dynamic test case error at runtime
     GTPv1C_Templates.ttcn:79.10-90.2: note: Referenced function is here
 GTPv1C_Templates.ttcn:1436.2-1471.2: In function definition `tr_GTPC_Cell_Identifier_V':
  GTPv1C_Templates.ttcn:1470.3-12: In return statement:
   GTPv1C_Templates.ttcn:1470.10-12: warning: Inadequate restriction on the referenced template variable `ret', this may cause a dynamic test case error at runtime
   GTPv1C_Templates.ttcn:1437.39-1447.3: note: Referenced template variable is here
Osmocom_Gb_Types.ttcn: In TTCN-3 module `Osmocom_Gb_Types':
 Osmocom_Gb_Types.ttcn:1050.10-1058.2: In function definition `f_tr_BSSGP_IMSI':
  Osmocom_Gb_Types.ttcn:1055.5-1057.3: In else statement:
   Osmocom_Gb_Types.ttcn:1056.4-29: In return statement:
    Osmocom_Gb_Types.ttcn:1056.24-29: In actual parameter list of template `@Osmocom_Gb_Types.tr_BSSGP_IMSI':
     Osmocom_Gb_Types.ttcn:1056.25-28: In parameter #1 for `imsi':
      Osmocom_Gb_Types.ttcn:1056.25-28: warning: Inadequate restriction on the referenced template parameter `imsi', this may cause a dynamic test case error at runtime
      Osmocom_Gb_Types.ttcn:1050.35-57: note: Referenced template parameter is here
RAW_NS.ttcn: In TTCN-3 module `RAW_NS':
 RAW_NS.ttcnpp:70.1-123.1: In function definition `f_init_ns_codec':
  RAW_NS.ttcnpp:89.2-120.2: In if statement:
   RAW_NS.ttcnpp:95.3-109.3: In if statement:
    RAW_NS.ttcnpp:108.4-95: In start test component statement:
     NS_Provider_IPL4.ttcn:119.1-209.1: In function definition `main':
      NS_Provider_IPL4.ttcn:141.2-207.2: In while statement:
       NS_Provider_IPL4.ttcn:149.2-206.2: In alt construct:
        NS_Provider_IPL4.ttcn:202.3-58: In variable assignment:
         NS_Provider_IPL4.ttcn:202.20-58: In actual parameter list of function `@NS_Provider_IPL4.f_nsvc_del':
          NS_Provider_IPL4.ttcn:202.21-57: In parameter #1 for `nsvc':
           NS_Provider_IPL4.ttcn:202.34-57: warning: Field `vc_nsvc' is missing from record value
NS_Emulation.ttcn: In TTCN-3 module `NS_Emulation':
 NS_Emulation.ttcnpp:331.2-362.2: In function definition `f_nsvc_add':
  NS_Emulation.ttcnpp:351.3-67: In start test component statement:
   NS_Emulation.ttcnpp:710.2-716.2: In function definition `NSVCStart':
    NS_Emulation.ttcnpp:715.3-16: In function instance:
     NS_Emulation.ttcnpp:1032.10-1043.2: In function definition `f_ScanEvents':
      NS_Emulation.ttcnpp:1034.3-1042.3: In while statement:
       NS_Emulation.ttcnpp:1035.4-1041.4: In alt construct:
        NS_Emulation.ttcnpp:1040.34-46: In guard statement:
         NS_Emulation.ttcnpp:763.10-826.2: In altstep definition `as_allstate':
          NS_Emulation.ttcnpp:784.4-20: In guard expression:
           NS_Emulation.ttcnpp:784.4-20: warning: State of timer(s) may change during the actual snapshot.
          NS_Emulation.ttcnpp:790.4-19: In guard expression:
           NS_Emulation.ttcnpp:790.4-19: warning: State of timer(s) may change during the actual snapshot.
          NS_Emulation.ttcnpp:796.4-20: In guard expression:
           NS_Emulation.ttcnpp:796.4-20: warning: State of timer(s) may change during the actual snapshot.
 NS_Emulation.ttcnpp:406.2-424.2: In function definition `NSStart':
  NS_Emulation.ttcnpp:419.3-423.3: In while statement:
   NS_Emulation.ttcnpp:420.4-422.4: In alt construct:
    NS_Emulation.ttcnpp:421.7-20: In guard statement:
     NS_Emulation.ttcnpp:467.10-509.2: In altstep definition `as_ns_common':
      NS_Emulation.ttcnpp:478.48-64: In guard statement:
       NS_Emulation.ttcnpp:629.10-680.2: In altstep definition `as_vcg_sns_sgsn':
        NS_Emulation.ttcnpp:637.6-640.33: In guard operation:
         NS_Emulation.ttcnpp:637.6-640.33: In receive statement:
          NS_Emulation.ttcnpp:638.10-639.52: warning: Function invocation 'tr_SNS_IPv4(g_config.nsvc[0].provider.ip.remote_ip, g_config.nsvc[0].provider.ip.remote_udp_port, -, -)' may change the actual snapshot.
      NS_Emulation.ttcnpp:479.52-67: In guard statement:
       NS_Emulation.ttcnpp:596.10-625.2: In altstep definition `as_vcg_sns_pcu':
        NS_Emulation.ttcnpp:601.6-604.33: In guard operation:
         NS_Emulation.ttcnpp:601.6-604.33: In receive statement:
          NS_Emulation.ttcnpp:602.10-603.52: warning: Function invocation 'tr_SNS_IPv4(g_config.nsvc[0].provider.ip.remote_ip, g_config.nsvc[0].provider.ip.remote_udp_port, -, -)' may change the actual snapshot.
BSSGP_Emulation.ttcn: In TTCN-3 module `BSSGP_Emulation':
 BSSGP_Emulation.ttcnpp:193.1-222.1: In function definition `BssgpStart':
  BSSGP_Emulation.ttcnpp:197.2-210.2: In for statement:
   BSSGP_Emulation.ttcnpp:203.3-78: In start test component statement:
    BSSGP_Emulation.ttcnpp:1364.9-1370.1: In function definition `f_bssgp_bvc_main':
     BSSGP_Emulation.ttcnpp:1369.2-25: In function instance:
      BSSGP_Emulation.ttcnpp:1353.9-1361.1: In function definition `f_bssgp_bvc_ScanEvents':
       BSSGP_Emulation.ttcnpp:1354.2-1360.2: In while statement:
        BSSGP_Emulation.ttcnpp:1355.3-1359.3: In alt construct:
         BSSGP_Emulation.ttcnpp:1356.38-53: In guard statement:
          BSSGP_Emulation.ttcnpp:1051.9-1086.1: In altstep definition `as_ptp_blocked':
           BSSGP_Emulation.ttcnpp:1054.3-47: In guard expression:
            BSSGP_Emulation.ttcnpp:1054.3-14: warning: State of timer(s) may change during the actual snapshot.
           BSSGP_Emulation.ttcnpp:1066.3-30: In guard expression:
            BSSGP_Emulation.ttcnpp:1066.3-14: warning: State of timer(s) may change during the actual snapshot.
           BSSGP_Emulation.ttcnpp:1071.3-34: In guard expression:
            BSSGP_Emulation.ttcnpp:1071.3-14: warning: State of timer(s) may change during the actual snapshot.
         BSSGP_Emulation.ttcnpp:1357.40-57: In guard statement:
          BSSGP_Emulation.ttcnpp:1089.9-1266.1: In altstep definition `as_ptp_unblocked':
           BSSGP_Emulation.ttcnpp:1113.3-43: In guard expression:
            BSSGP_Emulation.ttcnpp:1113.3-14: warning: State of timer(s) may change during the actual snapshot.
           BSSGP_Emulation.ttcnpp:1118.3-47: In guard expression:
            BSSGP_Emulation.ttcnpp:1118.3-14: warning: State of timer(s) may change during the actual snapshot.
           BSSGP_Emulation.ttcnpp:1121.3-43: In guard expression:
            BSSGP_Emulation.ttcnpp:1121.3-14: warning: State of timer(s) may change during the actual snapshot.
  BSSGP_Emulation.ttcnpp:221.2-21: In function instance:
   BSSGP_Emulation.ttcnpp:609.9-620.1: In function definition `f_bssgp_ScanEvents':
    BSSGP_Emulation.ttcnpp:610.2-619.2: In while statement:
     BSSGP_Emulation.ttcnpp:611.3-618.3: In alt construct:
      BSSGP_Emulation.ttcnpp:612.42-60: In guard statement:
       BSSGP_Emulation.ttcnpp:277.1-289.1: In altstep definition `as_sig_wait_reset':
        BSSGP_Emulation.ttcnpp:281.5-70: In guard operation:
         BSSGP_Emulation.ttcnpp:281.5-70: In receive statement:
          BSSGP_Emulation.ttcnpp:281.18-56: warning: Function invocation 'f_BnsUdInd({ pDU_BSSGP_BVC_RESET := { bssgpPduType := '22'O, bVCI := tr_BSSGP_BVCI(bvci), cause := tr_BSSGP_CAUSE(cause), cell_Identifier := tr_BSSGP_IE_CellId(cell_id), feature_bitmap := *, extended_Feature_Bitmap := * } }, 0)' may change the actual snapshot.
      BSSGP_Emulation.ttcnpp:613.6-26: In guard statement:
       BSSGP_Emulation.ttcnpp:420.1-467.1: In altstep definition `as_sig_allstate_pre':
        BSSGP_Emulation.ttcnpp:424.5-70: In guard operation:
         BSSGP_Emulation.ttcnpp:424.5-70: In receive statement:
          BSSGP_Emulation.ttcnpp:424.18-56: warning: Function invocation 'f_BnsUdInd({ pDU_BSSGP_BVC_RESET := { bssgpPduType := '22'O, bVCI := tr_BSSGP_BVCI(bvci), cause := tr_BSSGP_CAUSE(cause), cell_Identifier := tr_BSSGP_IE_CellId(cell_id), feature_bitmap := *, extended_Feature_Bitmap := * } }, 0)' may change the actual snapshot.
        BSSGP_Emulation.ttcnpp:438.5-64: In guard operation:
         BSSGP_Emulation.ttcnpp:438.5-64: In receive statement:
          BSSGP_Emulation.ttcnpp:438.18-50: warning: Function invocation 'f_BnsUdInd({ pDU_BSSGP_BVC_BLOCK := { bssgpPduType := '20'O, bVCI := tr_BSSGP_BVCI(bvci), cause := tr_BSSGP_CAUSE(cause) } }, 0)' may change the actual snapshot.
        BSSGP_Emulation.ttcnpp:441.5-63: In guard operation:
         BSSGP_Emulation.ttcnpp:441.5-63: In receive statement:
          BSSGP_Emulation.ttcnpp:441.18-49: warning: Function invocation 'f_BnsUdInd({ pDU_BSSGP_BVC_UNBLOCK := { bssgpPduType := '24'O, bVCI := tr_BSSGP_BVCI(bvci) } }, 0)' may change the actual snapshot.
        BSSGP_Emulation.ttcnpp:444.5-65: In guard operation:
         BSSGP_Emulation.ttcnpp:444.5-65: In receive statement:
          BSSGP_Emulation.ttcnpp:444.18-51: warning: Function invocation 'f_BnsUdInd({ pDU_BSSGP_BVC_BLOCK_ACK := { bssgpPduType := '21'O, bVCI := tr_BSSGP_BVCI(bvci) } }, 0)' may change the actual snapshot.
        BSSGP_Emulation.ttcnpp:447.5-67: In guard operation:
         BSSGP_Emulation.ttcnpp:447.5-67: In receive statement:
          BSSGP_Emulation.ttcnpp:447.18-53: warning: Function invocation 'f_BnsUdInd({ pDU_BSSGP_BVC_UNBLOCK_ACK := { bssgpPduType := '25'O, bVCI := tr_BSSGP_BVCI(bvci) } }, 0)' may change the actual snapshot.
        BSSGP_Emulation.ttcnpp:452.3-14: In guard expression:
         BSSGP_Emulation.ttcnpp:452.3-14: warning: State of timer(s) may change during the actual snapshot.
        BSSGP_Emulation.ttcnpp:452.17-83: In guard operation:
         BSSGP_Emulation.ttcnpp:452.17-83: In receive statement:
          BSSGP_Emulation.ttcnpp:452.30-69: warning: Function invocation 'f_BnsUdInd({ pDU_BSSGP_BVC_RESET_ACK := { bssgpPduType := '23'O, bVCI := tr_BSSGP_BVCI(bvci), cell_Identifier := tr_BSSGP_IE_CellId(cell_id), feature_bitmap := *, extended_Feature_Bitmap := * } }, 0)' may change the actual snapshot.
        BSSGP_Emulation.ttcnpp:462.3-14: In guard expression:
         BSSGP_Emulation.ttcnpp:462.3-14: warning: State of timer(s) may change during the actual snapshot.
      BSSGP_Emulation.ttcnpp:615.41-58: In guard statement:
       BSSGP_Emulation.ttcnpp:305.1-402.1: In altstep definition `as_sig_unblocked':
        BSSGP_Emulation.ttcnpp:313.5-56: In guard operation:
         BSSGP_Emulation.ttcnpp:313.5-56: In receive statement:
          BSSGP_Emulation.ttcnpp:313.18-42: warning: Function invocation 'f_BnsUdInd(?, (2 .. 65535))' may change the actual snapshot.
        BSSGP_Emulation.ttcnpp:325.5-59: In guard operation:
         BSSGP_Emulation.ttcnpp:325.5-59: In receive statement:
          BSSGP_Emulation.ttcnpp:325.18-45: warning: Function invocation 'f_BnsUdInd(({ pDU_BSSGP_SUSPEND := ? }, { pDU_BSSGP_SUSPEND_ACK := ? }, { pDU_BSSGP_SUSPEND_NACK := ? }, { pDU_BSSGP_RESUME := ? }, { pDU_BSSGP_RESUME_ACK := ? }, { pDU_BSSGP_RESUME_NACK := ? }, { pDU_BSSGP_SGSN_INVOKE_TRACE := ? }, { pDU_BSSGP_OVERLOAD := ? }, { pDU_BSSGP_STATUS := ? }), 0)' may change the actual snapshot.
        BSSGP_Emulation.ttcnpp:330.5-52: In guard operation:
         BSSGP_Emulation.ttcnpp:330.5-52: In receive statement:
          BSSGP_Emulation.ttcnpp:330.18-38: warning: Function invocation 'f_BnsUdInd(({ pDU_BSSGP_RAN_INFORMATION := ? }, { pDU_BSSGP_RAN_INFORMATION_REQUEST := ? }, { pDU_BSSGP_RAN_INFORMATION_ACK := ? }, { pDU_BSSGP_RAN_INFORMATION_ERROR := ? }, { pDU_BSSGP_RAN_INFORMATION_APPLICATION_ERROR := ? }), 0)' may change the actual snapshot.
        BSSGP_Emulation.ttcnpp:337.5-76: In guard operation:
         BSSGP_Emulation.ttcnpp:337.5-76: In receive statement:
          BSSGP_Emulation.ttcnpp:337.18-62: warning: Function invocation 'f_BnsUdInd({ pDU_BSSGP_FLUSH_LL_ACK := { bssgpPduType := '2B'O, tLLI := { iEI := '1F'O, ext := '1'B, lengthIndicator := { length1 := 4 }, tLLI_Value := tlli }, flush_Action := tr_FLUSH_ACTION(act), bVCI_new := f_ts_BSSGP_BVCI(bvci_new), number_of_octets_affected := tr_NO_OCT_AFF(oct_affected), nSEI := f_ts_BSSGP_NSEI(nsei) } }, 0)' may change the actual snapshot.
        BSSGP_Emulation.ttcnpp:347.5-47: In guard operation:
         BSSGP_Emulation.ttcnpp:347.5-47: In receive statement:
          BSSGP_Emulation.ttcnpp:347.18-33: warning: Function invocation 'f_BnsUdInd(?, 0)' may change the actual snapshot.
        BSSGP_Emulation.ttcnpp:369.5-80: In guard operation:
         BSSGP_Emulation.ttcnpp:369.5-80: In receive statement:
          BSSGP_Emulation.ttcnpp:369.18-66: warning: Function invocation 'f_BnsUdInd(@BSSGP_Types.PDU_BSSGP : { pDU_BSSGP_PAGING_PS := ? }, 0)' may change the actual snapshot.
        BSSGP_Emulation.ttcnpp:378.5-80: In guard operation:
         BSSGP_Emulation.ttcnpp:378.5-80: In receive statement:
          BSSGP_Emulation.ttcnpp:378.18-66: warning: Function invocation 'f_BnsUdInd(@BSSGP_Types.PDU_BSSGP : { pDU_BSSGP_PAGING_CS := ? }, 0)' may change the actual snapshot.
      BSSGP_Emulation.ttcnpp:617.6-27: In guard statement:
       BSSGP_Emulation.ttcnpp:470.1-555.1: In altstep definition `as_sig_allstate_post':
        BSSGP_Emulation.ttcnpp:480.5-70: In guard operation:
         BSSGP_Emulation.ttcnpp:480.5-70: In receive statement:
          BSSGP_Emulation.ttcnpp:480.18-56: warning: Function invocation 'f_BnsUdInd({ pDU_BSSGP_BVC_RESET := { bssgpPduType := '22'O, bVCI := tr_BSSGP_BVCI(bvci), cause := tr_BSSGP_CAUSE(cause), cell_Identifier := tr_BSSGP_IE_CellId(cell_id), feature_bitmap := *, extended_Feature_Bitmap := * } }, 0)' may change the actual snapshot.
        BSSGP_Emulation.ttcnpp:494.5-64: In guard operation:
         BSSGP_Emulation.ttcnpp:494.5-64: In receive statement:
          BSSGP_Emulation.ttcnpp:494.18-50: warning: Function invocation 'f_BnsUdInd({ pDU_BSSGP_BVC_BLOCK := { bssgpPduType := '20'O, bVCI := tr_BSSGP_BVCI(bvci), cause := tr_BSSGP_CAUSE(cause) } }, 0)' may change the actual snapshot.
        BSSGP_Emulation.ttcnpp:497.5-63: In guard operation:
         BSSGP_Emulation.ttcnpp:497.5-63: In receive statement:
          BSSGP_Emulation.ttcnpp:497.18-49: warning: Function invocation 'f_BnsUdInd({ pDU_BSSGP_BVC_UNBLOCK := { bssgpPduType := '24'O, bVCI := tr_BSSGP_BVCI(bvci) } }, 0)' may change the actual snapshot.
        BSSGP_Emulation.ttcnpp:500.5-65: In guard operation:
         BSSGP_Emulation.ttcnpp:500.5-65: In receive statement:
          BSSGP_Emulation.ttcnpp:500.18-51: warning: Function invocation 'f_BnsUdInd({ pDU_BSSGP_BVC_BLOCK_ACK := { bssgpPduType := '21'O, bVCI := tr_BSSGP_BVCI(bvci) } }, 0)' may change the actual snapshot.
        BSSGP_Emulation.ttcnpp:503.5-67: In guard operation:
         BSSGP_Emulation.ttcnpp:503.5-67: In receive statement:
          BSSGP_Emulation.ttcnpp:503.18-53: warning: Function invocation 'f_BnsUdInd({ pDU_BSSGP_BVC_UNBLOCK_ACK := { bssgpPduType := '25'O, bVCI := tr_BSSGP_BVCI(bvci) } }, 0)' may change the actual snapshot.
        BSSGP_Emulation.ttcnpp:508.5-64: In guard operation:
         BSSGP_Emulation.ttcnpp:508.5-64: In receive statement:
          BSSGP_Emulation.ttcnpp:508.18-50: warning: Function invocation 'f_BnsUdInd({ pDU_BSSGP_BVC_BLOCK := { bssgpPduType := '20'O, bVCI := tr_BSSGP_BVCI(bvci), cause := tr_BSSGP_CAUSE(cause) } }, 0)' may change the actual snapshot.
        BSSGP_Emulation.ttcnpp:514.5-67: In guard operation:
         BSSGP_Emulation.ttcnpp:514.5-67: In receive statement:
          BSSGP_Emulation.ttcnpp:514.18-53: warning: Function invocation 'f_BnsUdInd({ pDU_BSSGP_BVC_RESET := { bssgpPduType := '22'O, bVCI := tr_BSSGP_BVCI(bvci), cause := tr_BSSGP_CAUSE(cause), cell_Identifier := tr_BSSGP_IE_CellId(cell_id), feature_bitmap := *, extended_Feature_Bitmap := * } }, 0)' may change the actual snapshot.
        BSSGP_Emulation.ttcnpp:546.5-47: In guard operation:
         BSSGP_Emulation.ttcnpp:546.5-47: In receive statement:
          BSSGP_Emulation.ttcnpp:546.18-33: warning: Function invocation 'f_BnsUdInd(?, ?)' may change the actual snapshot.
RAN_Emulation.ttcn: In TTCN-3 module `RAN_Emulation':
 RAN_Emulation.ttcnpp:1409.1-1445.1: In function definition `RanapExpectedCreateCallback':
  RAN_Emulation.ttcnpp:1416.2-1424.2: In if statement:
   RAN_Emulation.ttcnpp:1419.3-1423.3: In if statement:
    RAN_Emulation.ttcnpp:1422.4-13: warning: Control never reaches this statement
  RAN_Emulation.ttcnpp:1444.2-11: warning: Control never reaches this statement
SGSN_Tests.ttcn: In TTCN-3 module `SGSN_Tests':
 SGSN_Tests.ttcn:655.1-677.1: In altstep definition `as_mm_identity':
  SGSN_Tests.ttcn:657.3-18: In guard expression:
   SGSN_Tests.ttcn:657.3-18: warning: Function invocation 'is_gb(ran_index)' may change the actual snapshot.
  SGSN_Tests.ttcn:662.3-18: In guard expression:
   SGSN_Tests.ttcn:662.3-18: warning: Function invocation 'is_iu(ran_index)' may change the actual snapshot.
  SGSN_Tests.ttcn:667.3-18: In guard expression:
   SGSN_Tests.ttcn:667.3-18: warning: Function invocation 'is_gb(ran_index)' may change the actual snapshot.
  SGSN_Tests.ttcn:672.3-18: In guard expression:
   SGSN_Tests.ttcn:672.3-18: warning: Function invocation 'is_iu(ran_index)' may change the actual snapshot.
 SGSN_Tests.ttcn:680.1-691.1: In function definition `f_receive_l3':
  SGSN_Tests.ttcn:684.2-689.2: In alt construct:
   SGSN_Tests.ttcn:685.3-18: In guard expression:
    SGSN_Tests.ttcn:685.3-18: warning: Function invocation 'is_gb(ran_index)' may change the actual snapshot.
   SGSN_Tests.ttcn:686.3-18: In guard expression:
    SGSN_Tests.ttcn:686.3-18: warning: Function invocation 'is_iu(ran_index)' may change the actual snapshot.
 SGSN_Tests.ttcn:724.1-797.1: In function definition `f_gmm_auth':
  SGSN_Tests.ttcn:728.2-791.2: In if statement:
   SGSN_Tests.ttcn:787.3-790.3: In if statement:
    SGSN_Tests.ttcn:789.4-62: In receive statement:
     SGSN_Tests.ttcn:789.36-60: warning: Function invocation 'imsi_hex2oct(g_pars.imsi)' may change the actual snapshot.
  SGSN_Tests.ttcn:796.2-15: In deactivate statement:
   SGSN_Tests.ttcn:796.2-15: warning: Calling `deactivate()' in a function or altstep. This might delete the `in' parameters of a currently running altstep.
 SGSN_Tests.ttcn:1026.9-1084.1: In function definition `f_TC_attach_timeout_after_pdp_act':
  SGSN_Tests.ttcn:1041.2-21: In function instance:
   SGSN_Tests.ttcn:1488.1-1531.1: In function definition `f_pdp_ctx_act':
    SGSN_Tests.ttcn:1500.76-1509.2: In statement block:
     SGSN_Tests.ttcn:1503.3-1508.22: In send statement:
      SGSN_Tests.ttcn:1503.33-1508.21: In actual parameter list of template `@GTPv1C_Templates.ts_GTPC_CreatePdpResp':
       SGSN_Tests.ttcn:1508.13-20: In parameter #12 for `recovery':
        SGSN_Tests.ttcn:1508.13-20: warning: Inadequate restriction on the referenced template variable `recovery', this may cause a dynamic test case error at runtime
        SGSN_Tests.ttcn:1492.29-44: note: Referenced template variable is here
 SGSN_Tests.ttcn:1338.9-1344.1: In function definition `f_TC_attach_rau':
  SGSN_Tests.ttcn:1342.2-33: In function instance:
   SGSN_Tests.ttcn:2673.8-2696.1: In function definition `f_routing_area_update':
    SGSN_Tests.ttcn:2687.2-2695.2: In alt construct:
     SGSN_Tests.ttcn:2688.5-37: In guard statement:
      SGSN_Tests.ttcn:2668.8-2671.1: In altstep definition `as_routing_area_update':
       SGSN_Tests.ttcn:2669.3-18: In guard expression:
        SGSN_Tests.ttcn:2669.3-18: warning: Function invocation 'is_gb(ran_index)' may change the actual snapshot.
       SGSN_Tests.ttcn:2670.3-18: In guard expression:
        SGSN_Tests.ttcn:2670.3-18: warning: Function invocation 'is_iu(ran_index)' may change the actual snapshot.
       SGSN_Tests.ttcn:2670.21-56: In guard statement:
        SGSN_Tests.ttcn:2647.8-2667.1: In altstep definition `as_routing_area_update_iu':
         SGSN_Tests.ttcn:2664.3-61: In receive statement:
          SGSN_Tests.ttcn:2664.35-59: warning: Function invocation 'imsi_hex2oct(g_pars.imsi)' may change the actual snapshot.
     SGSN_Tests.ttcn:2689.3-18: In guard expression:
      SGSN_Tests.ttcn:2689.3-18: warning: Function invocation 'is_gb(ran_index)' may change the actual snapshot.
     SGSN_Tests.ttcn:2690.3-18: In guard expression:
      SGSN_Tests.ttcn:2690.3-18: warning: Function invocation 'is_iu(ran_index)' may change the actual snapshot.
 SGSN_Tests.ttcn:2832.9-2934.1: In function definition `f_TC_attach_usim_resync':
  SGSN_Tests.ttcn:2924.2-15: In deactivate statement:
   SGSN_Tests.ttcn:2924.2-15: warning: Calling `deactivate()' in a function or altstep. This might delete the `in' parameters of a currently running altstep.
 SGSN_Tests.ttcn:2961.9-3007.1: In function definition `f_TC_attach_usim_crypt':
  SGSN_Tests.ttcn:3006.2-15: In deactivate statement:
   SGSN_Tests.ttcn:3006.2-15: warning: Calling `deactivate()' in a function or altstep. This might delete the `in' parameters of a currently running altstep.
 SGSN_Tests.ttcn:3261.9-3282.1: In function definition `f_TC_suspend_nopaging':
  SGSN_Tests.ttcn:3273.2-18: In function instance:
   SGSN_Tests.ttcn:3273.2-18: warning: The value returned by function `@SGSN_Tests.f_bssgp_suspend' is not used
  SGSN_Tests.ttcn:3281.2-14: In deactivate statement:
   SGSN_Tests.ttcn:3281.2-14: warning: Calling `deactivate()' in a function or altstep. This might delete the `in' parameters of a currently running altstep.
 SGSN_Tests.ttcn:3294.9-3322.1: In function definition `f_TC_suspend_resume':
  SGSN_Tests.ttcn:3315.2-14: In deactivate statement:
   SGSN_Tests.ttcn:3315.2-14: warning: Calling `deactivate()' in a function or altstep. This might delete the `in' parameters of a currently running altstep.
 SGSN_Tests.ttcn:3333.9-3364.1: In function definition `f_TC_suspend_rau':
  SGSN_Tests.ttcn:3345.2-18: In function instance:
   SGSN_Tests.ttcn:3345.2-18: warning: The value returned by function `@SGSN_Tests.f_bssgp_suspend' is not used
  SGSN_Tests.ttcn:3353.2-14: In deactivate statement:
   SGSN_Tests.ttcn:3353.2-14: warning: Calling `deactivate()' in a function or altstep. This might delete the `in' parameters of a currently running altstep.
 SGSN_Tests.ttcn:3412.1-3488.1: In testcase definition `TC_bssgp_rim_single_report':
  SGSN_Tests.ttcn:3437.2-3439.19: In variable assignment:
   SGSN_Tests.ttcn:3437.45-3439.19: In actual parameter list of template `@Osmocom_Gb_Types.ts_RAN_INFORMATION_REQUEST':
    SGSN_Tests.ttcn:3437.46-105: In parameter #1 for `dst':
     SGSN_Tests.ttcn:3437.72-105: In actual parameter list of template `@Osmocom_Gb_Types.ts_RIM_Routing_Information':
      SGSN_Tests.ttcn:3437.97-104: In parameter #2 for `addr':
       SGSN_Tests.ttcn:3437.97-104: warning: Inadequate restriction on the referenced template variable `dst_addr', this may cause a dynamic test case error at runtime
       SGSN_Tests.ttcn:3418.35-42: note: Referenced template variable is here
    SGSN_Tests.ttcn:3438.11-70: In parameter #2 for `src':
     SGSN_Tests.ttcn:3438.37-70: In actual parameter list of template `@Osmocom_Gb_Types.ts_RIM_Routing_Information':
      SGSN_Tests.ttcn:3438.62-69: In parameter #2 for `addr':
       SGSN_Tests.ttcn:3438.62-69: warning: Inadequate restriction on the referenced template variable `src_addr', this may cause a dynamic test case error at runtime
       SGSN_Tests.ttcn:3419.35-42: note: Referenced template variable is here
  SGSN_Tests.ttcn:3466.2-3468.22: In variable assignment:
   SGSN_Tests.ttcn:3466.47-3468.22: In actual parameter list of template `@Osmocom_Gb_Types.ts_PDU_BSSGP_RAN_INFORMATION':
    SGSN_Tests.ttcn:3466.48-107: In parameter #1 for `dst':
     SGSN_Tests.ttcn:3466.74-107: In actual parameter list of template `@Osmocom_Gb_Types.ts_RIM_Routing_Information':
      SGSN_Tests.ttcn:3466.99-106: In parameter #2 for `addr':
       SGSN_Tests.ttcn:3466.99-106: warning: Inadequate restriction on the referenced template variable `src_addr', this may cause a dynamic test case error at runtime
       SGSN_Tests.ttcn:3419.35-42: note: Referenced template variable is here
    SGSN_Tests.ttcn:3467.14-73: In parameter #2 for `src':
     SGSN_Tests.ttcn:3467.40-73: In actual parameter list of template `@Osmocom_Gb_Types.ts_RIM_Routing_Information':
      SGSN_Tests.ttcn:3467.65-72: In parameter #2 for `addr':
       SGSN_Tests.ttcn:3467.65-72: warning: Inadequate restriction on the referenced template variable `dst_addr', this may cause a dynamic test case error at runtime
       SGSN_Tests.ttcn:3418.35-42: note: Referenced template variable is here
 SGSN_Tests.ttcn:3490.1-3598.1: In testcase definition `TC_rim_eutran_to_geran':
  SGSN_Tests.ttcn:3563.2-3565.21: In variable assignment:
   SGSN_Tests.ttcn:3563.47-3565.21: In actual parameter list of template `@Osmocom_Gb_Types.ts_PDU_BSSGP_RAN_INFORMATION':
    SGSN_Tests.ttcn:3563.48-115: In parameter #1 for `dst':
     SGSN_Tests.ttcn:3563.74-115: In actual parameter list of template `@Osmocom_Gb_Types.ts_RIM_Routing_Information':
      SGSN_Tests.ttcn:3563.101-114: In parameter #2 for `addr':
       SGSN_Tests.ttcn:3563.101-114: warning: Inadequate restriction on the referenced template variable `bssgp_src_addr', this may cause a dynamic test case error at runtime
       SGSN_Tests.ttcn:3530.51-64: note: Referenced template variable is here
    SGSN_Tests.ttcn:3564.13-78: In parameter #2 for `src':
     SGSN_Tests.ttcn:3564.39-78: In actual parameter list of template `@Osmocom_Gb_Types.ts_RIM_Routing_Information':
      SGSN_Tests.ttcn:3564.64-77: In parameter #2 for `addr':
       SGSN_Tests.ttcn:3564.64-77: warning: Inadequate restriction on the referenced template variable `bssgp_dst_addr', this may cause a dynamic test case error at runtime
       SGSN_Tests.ttcn:3530.35-48: note: Referenced template variable is here
  SGSN_Tests.ttcn:3577.2-3579.22: In variable assignment:
   SGSN_Tests.ttcn:3577.48-3579.22: In actual parameter list of template `@GTPv1C_Templates.tr_GTPC_RAN_Information':
    SGSN_Tests.ttcn:3579.14-21: In parameter #3 for `cont':
     SGSN_Tests.ttcn:3579.14-21: warning: Inadequate restriction on the referenced template variable `rim_cont', this may cause a dynamic test case error at runtime
     SGSN_Tests.ttcn:3568.50-57: note: Referenced template variable is here
  SGSN_Tests.ttcn:3580.2-101: In variable assignment:
   SGSN_Tests.ttcn:3580.38-101: In actual parameter list of template `@GTPv1C_Templates.tr_GTPC_RANInfoRelay':
    SGSN_Tests.ttcn:3580.45-100: In parameter #2 for `transparentContainer':
     SGSN_Tests.ttcn:3580.80-100: In actual parameter list of template `@GTPv1C_Templates.tr_RANTransparentContainer_RAN_INFO':
      SGSN_Tests.ttcn:3580.81-99: In parameter #1 for `pdu':
       SGSN_Tests.ttcn:3580.81-99: warning: Inadequate restriction on the referenced template variable `gtpc_bssgp_cont_ack', this may cause a dynamic test case error at runtime
       SGSN_Tests.ttcn:3569.46-64: note: Referenced template variable is here
 SGSN_Tests.ttcn:3733.9-3798.1: In function definition `f_TC_sgsn_context_req_in':
  SGSN_Tests.ttcn:3779.2-3793.2: In alt construct:
   SGSN_Tests.ttcn:3786.3-3787.58: In send statement:
    SGSN_Tests.ttcn:3786.34-3787.57: In actual parameter list of template `@GTPv1C_Templates.ts_GTPC_SGSNContextAck':
     SGSN_Tests.ttcn:3787.7-56: In parameter #4 for `SGSNContextAckPDU':
      GTPv1C_Templates.ttcn:77.17-48: warning: Inadequate restriction on the referenced function `enum2oct1_Cause_gtpc_tmpl(cause)', this may cause a dynamic test case error at runtime
      GTPv1C_Templates.ttcn:79.10-90.2: note: Referenced function is here
 SGSN_Tests.ttcn:3810.9-3897.1: In function definition `f_TC_sgsn_context_req_out':
  SGSN_Tests.ttcn:3857.2-3861.34: In variable assignment:
   GTPv1C_Templates.ttcn:77.17-48: warning: Inadequate restriction on the referenced function `enum2oct1_Cause_gtpc_tmpl(cause)', this may cause a dynamic test case error at runtime
   GTPv1C_Templates.ttcn:79.10-90.2: note: Referenced function is here
Notify: Generating code...
Notify: File `BSSGP_Emulation.hh' was generated.
Notify: File `BSSGP_Emulation.cc' was generated.
Notify: File `BSSGP_Emulation_part_1.cc' was generated.
Notify: File `BSSGP_Emulation_part_2.cc' was generated.
Notify: File `BSSGP_Emulation_part_3.cc' was generated.
Notify: File `BSSGP_Emulation_part_4.cc' was generated.
Notify: File `BSSGP_Emulation_part_5.cc' was generated.
Notify: File `BSSGP_Emulation_part_6.cc' was generated.
Notify: File `BSSGP_Emulation_part_7.cc' was generated.
Notify: File `BSSGP_Types.hh' was generated.
Notify: File `BSSGP_Types.cc' was generated.
Notify: File `BSSGP_Types_part_1.cc' was generated.
Notify: File `BSSGP_Types_part_2.cc' was generated.
Notify: File `BSSGP_Types_part_3.cc' was generated.
Notify: File `BSSGP_Types_part_4.cc' was generated.
Notify: File `BSSGP_Types_part_5.cc' was generated.
Notify: File `BSSGP_Types_part_6.cc' was generated.
Notify: File `BSSGP_Types_part_7.cc' was generated.
Notify: File `GSM_Types.hh' was generated.
Notify: File `GSM_Types.cc' was generated.
Notify: File `GSM_Types_part_1.cc' was generated.
Notify: File `GSM_Types_part_2.cc' was generated.
Notify: File `GSM_Types_part_3.cc' was generated.
Notify: File `GSM_Types_part_4.cc' was generated.
Notify: File `GSM_Types_part_5.cc' was generated.
Notify: File `GSM_Types_part_6.cc' was generated.
Notify: File `GSM_Types_part_7.cc' was generated.
Notify: File `GSUP_Emulation.hh' was generated.
Notify: File `GSUP_Emulation.cc' was generated.
Notify: File `GSUP_Emulation_part_1.cc' was generated.
Notify: File `GSUP_Emulation_part_2.cc' was generated.
Notify: File `GSUP_Emulation_part_3.cc' was generated.
Notify: File `GSUP_Emulation_part_4.cc' was generated.
Notify: File `GSUP_Emulation_part_5.cc' was generated.
Notify: File `GSUP_Emulation_part_6.cc' was generated.
Notify: File `GSUP_Emulation_part_7.cc' was generated.
Notify: File `GSUP_Templates.hh' was generated.
Notify: File `GSUP_Templates.cc' was generated.
Notify: File `GSUP_Templates_part_1.cc' was generated.
Notify: File `GSUP_Templates_part_2.cc' was generated.
Notify: File `GSUP_Templates_part_3.cc' was generated.
Notify: File `GSUP_Templates_part_4.cc' was generated.
Notify: File `GSUP_Templates_part_5.cc' was generated.
Notify: File `GSUP_Templates_part_6.cc' was generated.
Notify: File `GSUP_Templates_part_7.cc' was generated.
Notify: File `GSUP_Types.hh' was generated.
Notify: File `GSUP_Types.cc' was generated.
Notify: File `GSUP_Types_part_1.cc' was generated.
Notify: File `GSUP_Types_part_2.cc' was generated.
Notify: File `GSUP_Types_part_3.cc' was generated.
Notify: File `GSUP_Types_part_4.cc' was generated.
Notify: File `GSUP_Types_part_5.cc' was generated.
Notify: File `GSUP_Types_part_6.cc' was generated.
Notify: File `GSUP_Types_part_7.cc' was generated.
Notify: File `GTPC_Types.hh' was generated.
Notify: File `GTPC_Types.cc' was generated.
Notify: File `GTPC_Types_part_1.cc' was generated.
Notify: File `GTPC_Types_part_2.cc' was generated.
Notify: File `GTPC_Types_part_3.cc' was generated.
Notify: File `GTPC_Types_part_4.cc' was generated.
Notify: File `GTPC_Types_part_5.cc' was generated.
Notify: File `GTPC_Types_part_6.cc' was generated.
Notify: File `GTPC_Types_part_7.cc' was generated.
Notify: File `GTPU_Types.hh' was generated.
Notify: File `GTPU_Types.cc' was generated.
Notify: File `GTPU_Types_part_1.cc' was generated.
Notify: File `GTPU_Types_part_2.cc' was generated.
Notify: File `GTPU_Types_part_3.cc' was generated.
Notify: File `GTPU_Types_part_4.cc' was generated.
Notify: File `GTPU_Types_part_5.cc' was generated.
Notify: File `GTPU_Types_part_6.cc' was generated.
Notify: File `GTPU_Types_part_7.cc' was generated.
Notify: File `GTP_Emulation.hh' was generated.
Notify: File `GTP_Emulation.cc' was generated.
Notify: File `GTP_Emulation_part_1.cc' was generated.
Notify: File `GTP_Emulation_part_2.cc' was generated.
Notify: File `GTP_Emulation_part_3.cc' was generated.
Notify: File `GTP_Emulation_part_4.cc' was generated.
Notify: File `GTP_Emulation_part_5.cc' was generated.
Notify: File `GTP_Emulation_part_6.cc' was generated.
Notify: File `GTP_Emulation_part_7.cc' was generated.
Notify: File `GTPv1C_CodecPort.hh' was generated.
Notify: File `GTPv1C_CodecPort.cc' was generated.
Notify: File `GTPv1C_CodecPort_CtrlFunct.hh' was generated.
Notify: File `GTPv1C_CodecPort_CtrlFunct.cc' was generated.
Notify: File `GTPv1C_CodecPort_CtrlFunct_part_1.cc' was generated.
Notify: File `GTPv1C_CodecPort_CtrlFunct_part_2.cc' was generated.
Notify: File `GTPv1C_CodecPort_CtrlFunct_part_3.cc' was generated.
Notify: File `GTPv1C_CodecPort_CtrlFunct_part_4.cc' was generated.
Notify: File `GTPv1C_CodecPort_CtrlFunct_part_5.cc' was generated.
Notify: File `GTPv1C_CodecPort_CtrlFunct_part_6.cc' was generated.
Notify: File `GTPv1C_CodecPort_CtrlFunct_part_7.cc' was generated.
Notify: File `GTPv1C_CodecPort_part_1.cc' was generated.
Notify: File `GTPv1C_CodecPort_part_2.cc' was generated.
Notify: File `GTPv1C_CodecPort_part_3.cc' was generated.
Notify: File `GTPv1C_CodecPort_part_4.cc' was generated.
Notify: File `GTPv1C_CodecPort_part_5.cc' was generated.
Notify: File `GTPv1C_CodecPort_part_6.cc' was generated.
Notify: File `GTPv1C_CodecPort_part_7.cc' was generated.
Notify: File `GTPv1C_Templates.hh' was generated.
Notify: File `GTPv1C_Templates.cc' was generated.
Notify: File `GTPv1C_Templates_part_1.cc' was generated.
Notify: File `GTPv1C_Templates_part_2.cc' was generated.
Notify: File `GTPv1C_Templates_part_3.cc' was generated.
Notify: File `GTPv1C_Templates_part_4.cc' was generated.
Notify: File `GTPv1C_Templates_part_5.cc' was generated.
Notify: File `GTPv1C_Templates_part_6.cc' was generated.
Notify: File `GTPv1C_Templates_part_7.cc' was generated.
Notify: File `GTPv1U_CodecPort.hh' was generated.
Notify: File `GTPv1U_CodecPort.cc' was generated.
Notify: File `GTPv1U_CodecPort_CtrlFunct.hh' was generated.
Notify: File `GTPv1U_CodecPort_CtrlFunct.cc' was generated.
Notify: File `GTPv1U_CodecPort_CtrlFunct_part_1.cc' was generated.
Notify: File `GTPv1U_CodecPort_CtrlFunct_part_2.cc' was generated.
Notify: File `GTPv1U_CodecPort_CtrlFunct_part_3.cc' was generated.
Notify: File `GTPv1U_CodecPort_CtrlFunct_part_4.cc' was generated.
Notify: File `GTPv1U_CodecPort_CtrlFunct_part_5.cc' was generated.
Notify: File `GTPv1U_CodecPort_CtrlFunct_part_6.cc' was generated.
Notify: File `GTPv1U_CodecPort_CtrlFunct_part_7.cc' was generated.
Notify: File `GTPv1U_CodecPort_part_1.cc' was generated.
Notify: File `GTPv1U_CodecPort_part_2.cc' was generated.
Notify: File `GTPv1U_CodecPort_part_3.cc' was generated.
Notify: File `GTPv1U_CodecPort_part_4.cc' was generated.
Notify: File `GTPv1U_CodecPort_part_5.cc' was generated.
Notify: File `GTPv1U_CodecPort_part_6.cc' was generated.
Notify: File `GTPv1U_CodecPort_part_7.cc' was generated.
Notify: File `GTPv1U_Templates.hh' was generated.
Notify: File `GTPv1U_Templates.cc' was generated.
Notify: File `GTPv1U_Templates_part_1.cc' was generated.
Notify: File `GTPv1U_Templates_part_2.cc' was generated.
Notify: File `GTPv1U_Templates_part_3.cc' was generated.
Notify: File `GTPv1U_Templates_part_4.cc' was generated.
Notify: File `GTPv1U_Templates_part_5.cc' was generated.
Notify: File `GTPv1U_Templates_part_6.cc' was generated.
Notify: File `GTPv1U_Templates_part_7.cc' was generated.
Notify: File `General_Types.hh' was generated.
Notify: File `General_Types.cc' was generated.
Notify: File `General_Types_part_1.cc' was generated.
Notify: File `General_Types_part_2.cc' was generated.
Notify: File `General_Types_part_3.cc' was generated.
Notify: File `General_Types_part_4.cc' was generated.
Notify: File `General_Types_part_5.cc' was generated.
Notify: File `General_Types_part_6.cc' was generated.
Notify: File `General_Types_part_7.cc' was generated.
Notify: File `IPA_CodecPort.hh' was generated.
Notify: File `IPA_CodecPort.cc' was generated.
Notify: File `IPA_CodecPort_CtrlFunct.hh' was generated.
Notify: File `IPA_CodecPort_CtrlFunct.cc' was generated.
Notify: File `IPA_CodecPort_CtrlFunct_part_1.cc' was generated.
Notify: File `IPA_CodecPort_CtrlFunct_part_2.cc' was generated.
Notify: File `IPA_CodecPort_CtrlFunct_part_3.cc' was generated.
Notify: File `IPA_CodecPort_CtrlFunct_part_4.cc' was generated.
Notify: File `IPA_CodecPort_CtrlFunct_part_5.cc' was generated.
Notify: File `IPA_CodecPort_CtrlFunct_part_6.cc' was generated.
Notify: File `IPA_CodecPort_CtrlFunct_part_7.cc' was generated.
Notify: File `IPA_CodecPort_part_1.cc' was generated.
Notify: File `IPA_CodecPort_part_2.cc' was generated.
Notify: File `IPA_CodecPort_part_3.cc' was generated.
Notify: File `IPA_CodecPort_part_4.cc' was generated.
Notify: File `IPA_CodecPort_part_5.cc' was generated.
Notify: File `IPA_CodecPort_part_6.cc' was generated.
Notify: File `IPA_CodecPort_part_7.cc' was generated.
Notify: File `IPA_Emulation.hh' was generated.
Notify: File `IPA_Emulation.cc' was generated.
Notify: File `IPA_Emulation_part_1.cc' was generated.
Notify: File `IPA_Emulation_part_2.cc' was generated.
Notify: File `IPA_Emulation_part_3.cc' was generated.
Notify: File `IPA_Emulation_part_4.cc' was generated.
Notify: File `IPA_Emulation_part_5.cc' was generated.
Notify: File `IPA_Emulation_part_6.cc' was generated.
Notify: File `IPA_Emulation_part_7.cc' was generated.
Notify: File `IPA_Types.hh' was generated.
Notify: File `IPA_Types.cc' was generated.
Notify: File `IPA_Types_part_1.cc' was generated.
Notify: File `IPA_Types_part_2.cc' was generated.
Notify: File `IPA_Types_part_3.cc' was generated.
Notify: File `IPA_Types_part_4.cc' was generated.
Notify: File `IPA_Types_part_5.cc' was generated.
Notify: File `IPA_Types_part_6.cc' was generated.
Notify: File `IPA_Types_part_7.cc' was generated.
Notify: File `IPCP_Types.hh' was generated.
Notify: File `IPCP_Types.cc' was generated.
Notify: File `IPCP_Types_part_1.cc' was generated.
Notify: File `IPCP_Types_part_2.cc' was generated.
Notify: File `IPCP_Types_part_3.cc' was generated.
Notify: File `IPCP_Types_part_4.cc' was generated.
Notify: File `IPCP_Types_part_5.cc' was generated.
Notify: File `IPCP_Types_part_6.cc' was generated.
Notify: File `IPCP_Types_part_7.cc' was generated.
Notify: File `IPL4asp_Functions.hh' was generated.
Notify: File `IPL4asp_Functions.cc' was generated.
Notify: File `IPL4asp_Functions_part_1.cc' was generated.
Notify: File `IPL4asp_Functions_part_2.cc' was generated.
Notify: File `IPL4asp_Functions_part_3.cc' was generated.
Notify: File `IPL4asp_Functions_part_4.cc' was generated.
Notify: File `IPL4asp_Functions_part_5.cc' was generated.
Notify: File `IPL4asp_Functions_part_6.cc' was generated.
Notify: File `IPL4asp_Functions_part_7.cc' was generated.
Notify: File `IPL4asp_PortType.hh' was generated.
Notify: File `IPL4asp_PortType.cc' was generated.
Notify: File `IPL4asp_PortType_part_1.cc' was generated.
Notify: File `IPL4asp_PortType_part_2.cc' was generated.
Notify: File `IPL4asp_PortType_part_3.cc' was generated.
Notify: File `IPL4asp_PortType_part_4.cc' was generated.
Notify: File `IPL4asp_PortType_part_5.cc' was generated.
Notify: File `IPL4asp_PortType_part_6.cc' was generated.
Notify: File `IPL4asp_PortType_part_7.cc' was generated.
Notify: File `IPL4asp_Types.hh' was generated.
Notify: File `IPL4asp_Types.cc' was generated.
Notify: File `IPL4asp_Types_part_1.cc' was generated.
Notify: File `IPL4asp_Types_part_2.cc' was generated.
Notify: File `IPL4asp_Types_part_3.cc' was generated.
Notify: File `IPL4asp_Types_part_4.cc' was generated.
Notify: File `IPL4asp_Types_part_5.cc' was generated.
Notify: File `IPL4asp_Types_part_6.cc' was generated.
Notify: File `IPL4asp_Types_part_7.cc' was generated.
Notify: File `L3_Common.hh' was generated.
Notify: File `L3_Common.cc' was generated.
Notify: File `L3_Common_part_1.cc' was generated.
Notify: File `L3_Common_part_2.cc' was generated.
Notify: File `L3_Common_part_3.cc' was generated.
Notify: File `L3_Common_part_4.cc' was generated.
Notify: File `L3_Common_part_5.cc' was generated.
Notify: File `L3_Common_part_6.cc' was generated.
Notify: File `L3_Common_part_7.cc' was generated.
Notify: File `L3_Templates.hh' was generated.
Notify: File `L3_Templates.cc' was generated.
Notify: File `L3_Templates_part_1.cc' was generated.
Notify: File `L3_Templates_part_2.cc' was generated.
Notify: File `L3_Templates_part_3.cc' was generated.
Notify: File `L3_Templates_part_4.cc' was generated.
Notify: File `L3_Templates_part_5.cc' was generated.
Notify: File `L3_Templates_part_6.cc' was generated.
Notify: File `L3_Templates_part_7.cc' was generated.
Notify: File `LLC_Templates.hh' was generated.
Notify: File `LLC_Templates.cc' was generated.
Notify: File `LLC_Templates_part_1.cc' was generated.
Notify: File `LLC_Templates_part_2.cc' was generated.
Notify: File `LLC_Templates_part_3.cc' was generated.
Notify: File `LLC_Templates_part_4.cc' was generated.
Notify: File `LLC_Templates_part_5.cc' was generated.
Notify: File `LLC_Templates_part_6.cc' was generated.
Notify: File `LLC_Templates_part_7.cc' was generated.
Notify: File `LLC_Types.hh' was generated.
Notify: File `LLC_Types.cc' was generated.
Notify: File `LLC_Types_part_1.cc' was generated.
Notify: File `LLC_Types_part_2.cc' was generated.
Notify: File `LLC_Types_part_3.cc' was generated.
Notify: File `LLC_Types_part_4.cc' was generated.
Notify: File `LLC_Types_part_5.cc' was generated.
Notify: File `LLC_Types_part_6.cc' was generated.
Notify: File `LLC_Types_part_7.cc' was generated.
Notify: File `M3UA_Emulation.hh' was generated.
Notify: File `M3UA_Emulation.cc' was generated.
Notify: File `M3UA_Emulation_part_1.cc' was generated.
Notify: File `M3UA_Emulation_part_2.cc' was generated.
Notify: File `M3UA_Emulation_part_3.cc' was generated.
Notify: File `M3UA_Emulation_part_4.cc' was generated.
Notify: File `M3UA_Emulation_part_5.cc' was generated.
Notify: File `M3UA_Emulation_part_6.cc' was generated.
Notify: File `M3UA_Emulation_part_7.cc' was generated.
Notify: File `M3UA_Types.hh' was generated.
Notify: File `M3UA_Types.cc' was generated.
Notify: File `M3UA_Types_part_1.cc' was generated.
Notify: File `M3UA_Types_part_2.cc' was generated.
Notify: File `M3UA_Types_part_3.cc' was generated.
Notify: File `M3UA_Types_part_4.cc' was generated.
Notify: File `M3UA_Types_part_5.cc' was generated.
Notify: File `M3UA_Types_part_6.cc' was generated.
Notify: File `M3UA_Types_part_7.cc' was generated.
Notify: File `MTP3asp_PortType.hh' was generated.
Notify: File `MTP3asp_PortType.cc' was generated.
Notify: File `MTP3asp_PortType_part_1.cc' was generated.
Notify: File `MTP3asp_PortType_part_2.cc' was generated.
Notify: File `MTP3asp_PortType_part_3.cc' was generated.
Notify: File `MTP3asp_PortType_part_4.cc' was generated.
Notify: File `MTP3asp_PortType_part_5.cc' was generated.
Notify: File `MTP3asp_PortType_part_6.cc' was generated.
Notify: File `MTP3asp_PortType_part_7.cc' was generated.
Notify: File `MTP3asp_Types.hh' was generated.
Notify: File `MTP3asp_Types.cc' was generated.
Notify: File `MTP3asp_Types_part_1.cc' was generated.
Notify: File `MTP3asp_Types_part_2.cc' was generated.
Notify: File `MTP3asp_Types_part_3.cc' was generated.
Notify: File `MTP3asp_Types_part_4.cc' was generated.
Notify: File `MTP3asp_Types_part_5.cc' was generated.
Notify: File `MTP3asp_Types_part_6.cc' was generated.
Notify: File `MTP3asp_Types_part_7.cc' was generated.
Notify: File `Misc_Helpers.hh' was generated.
Notify: File `Misc_Helpers.cc' was generated.
Notify: File `Misc_Helpers_part_1.cc' was generated.
Notify: File `Misc_Helpers_part_2.cc' was generated.
Notify: File `Misc_Helpers_part_3.cc' was generated.
Notify: File `Misc_Helpers_part_4.cc' was generated.
Notify: File `Misc_Helpers_part_5.cc' was generated.
Notify: File `Misc_Helpers_part_6.cc' was generated.
Notify: File `Misc_Helpers_part_7.cc' was generated.
Notify: File `MobileL3_CC_Types.hh' was generated.
Notify: File `MobileL3_CC_Types.cc' was generated.
Notify: File `MobileL3_CC_Types_part_1.cc' was generated.
Notify: File `MobileL3_CC_Types_part_2.cc' was generated.
Notify: File `MobileL3_CC_Types_part_3.cc' was generated.
Notify: File `MobileL3_CC_Types_part_4.cc' was generated.
Notify: File `MobileL3_CC_Types_part_5.cc' was generated.
Notify: File `MobileL3_CC_Types_part_6.cc' was generated.
Notify: File `MobileL3_CC_Types_part_7.cc' was generated.
Notify: File `MobileL3_CommonIE_Types.hh' was generated.
Notify: File `MobileL3_CommonIE_Types.cc' was generated.
Notify: File `MobileL3_CommonIE_Types_part_1.cc' was generated.
Notify: File `MobileL3_CommonIE_Types_part_2.cc' was generated.
Notify: File `MobileL3_CommonIE_Types_part_3.cc' was generated.
Notify: File `MobileL3_CommonIE_Types_part_4.cc' was generated.
Notify: File `MobileL3_CommonIE_Types_part_5.cc' was generated.
Notify: File `MobileL3_CommonIE_Types_part_6.cc' was generated.
Notify: File `MobileL3_CommonIE_Types_part_7.cc' was generated.
Notify: File `MobileL3_GMM_SM_Types.hh' was generated.
Notify: File `MobileL3_GMM_SM_Types.cc' was generated.
Notify: File `MobileL3_GMM_SM_Types_part_1.cc' was generated.
Notify: File `MobileL3_GMM_SM_Types_part_2.cc' was generated.
Notify: File `MobileL3_GMM_SM_Types_part_3.cc' was generated.
Notify: File `MobileL3_GMM_SM_Types_part_4.cc' was generated.
Notify: File `MobileL3_GMM_SM_Types_part_5.cc' was generated.
Notify: File `MobileL3_GMM_SM_Types_part_6.cc' was generated.
Notify: File `MobileL3_GMM_SM_Types_part_7.cc' was generated.
Notify: File `MobileL3_MM_Types.hh' was generated.
Notify: File `MobileL3_MM_Types.cc' was generated.
Notify: File `MobileL3_MM_Types_part_1.cc' was generated.
Notify: File `MobileL3_MM_Types_part_2.cc' was generated.
Notify: File `MobileL3_MM_Types_part_3.cc' was generated.
Notify: File `MobileL3_MM_Types_part_4.cc' was generated.
Notify: File `MobileL3_MM_Types_part_5.cc' was generated.
Notify: File `MobileL3_MM_Types_part_6.cc' was generated.
Notify: File `MobileL3_MM_Types_part_7.cc' was generated.
Notify: File `MobileL3_RRM_Types.hh' was generated.
Notify: File `MobileL3_RRM_Types.cc' was generated.
Notify: File `MobileL3_RRM_Types_part_1.cc' was generated.
Notify: File `MobileL3_RRM_Types_part_2.cc' was generated.
Notify: File `MobileL3_RRM_Types_part_3.cc' was generated.
Notify: File `MobileL3_RRM_Types_part_4.cc' was generated.
Notify: File `MobileL3_RRM_Types_part_5.cc' was generated.
Notify: File `MobileL3_RRM_Types_part_6.cc' was generated.
Notify: File `MobileL3_RRM_Types_part_7.cc' was generated.
Notify: File `MobileL3_SMS_Types.hh' was generated.
Notify: File `MobileL3_SMS_Types.cc' was generated.
Notify: File `MobileL3_SMS_Types_part_1.cc' was generated.
Notify: File `MobileL3_SMS_Types_part_2.cc' was generated.
Notify: File `MobileL3_SMS_Types_part_3.cc' was generated.
Notify: File `MobileL3_SMS_Types_part_4.cc' was generated.
Notify: File `MobileL3_SMS_Types_part_5.cc' was generated.
Notify: File `MobileL3_SMS_Types_part_6.cc' was generated.
Notify: File `MobileL3_SMS_Types_part_7.cc' was generated.
Notify: File `MobileL3_SS_Types.hh' was generated.
Notify: File `MobileL3_SS_Types.cc' was generated.
Notify: File `MobileL3_SS_Types_part_1.cc' was generated.
Notify: File `MobileL3_SS_Types_part_2.cc' was generated.
Notify: File `MobileL3_SS_Types_part_3.cc' was generated.
Notify: File `MobileL3_SS_Types_part_4.cc' was generated.
Notify: File `MobileL3_SS_Types_part_5.cc' was generated.
Notify: File `MobileL3_SS_Types_part_6.cc' was generated.
Notify: File `MobileL3_SS_Types_part_7.cc' was generated.
Notify: File `MobileL3_Types.hh' was generated.
Notify: File `MobileL3_Types.cc' was generated.
Notify: File `MobileL3_Types_part_1.cc' was generated.
Notify: File `MobileL3_Types_part_2.cc' was generated.
Notify: File `MobileL3_Types_part_3.cc' was generated.
Notify: File `MobileL3_Types_part_4.cc' was generated.
Notify: File `MobileL3_Types_part_5.cc' was generated.
Notify: File `MobileL3_Types_part_6.cc' was generated.
Notify: File `MobileL3_Types_part_7.cc' was generated.
Notify: File `NS_Emulation.hh' was generated.
Notify: File `NS_Emulation.cc' was generated.
Notify: File `NS_Emulation_part_1.cc' was generated.
Notify: File `NS_Emulation_part_2.cc' was generated.
Notify: File `NS_Emulation_part_3.cc' was generated.
Notify: File `NS_Emulation_part_4.cc' was generated.
Notify: File `NS_Emulation_part_5.cc' was generated.
Notify: File `NS_Emulation_part_6.cc' was generated.
Notify: File `NS_Emulation_part_7.cc' was generated.
Notify: File `NS_Provider_IPL4.hh' was generated.
Notify: File `NS_Provider_IPL4.cc' was generated.
Notify: File `NS_Provider_IPL4_part_1.cc' was generated.
Notify: File `NS_Provider_IPL4_part_2.cc' was generated.
Notify: File `NS_Provider_IPL4_part_3.cc' was generated.
Notify: File `NS_Provider_IPL4_part_4.cc' was generated.
Notify: File `NS_Provider_IPL4_part_5.cc' was generated.
Notify: File `NS_Provider_IPL4_part_6.cc' was generated.
Notify: File `NS_Provider_IPL4_part_7.cc' was generated.
Notify: File `NS_Types.hh' was generated.
Notify: File `NS_Types.cc' was generated.
Notify: File `NS_Types_part_1.cc' was generated.
Notify: File `NS_Types_part_2.cc' was generated.
Notify: File `NS_Types_part_3.cc' was generated.
Notify: File `NS_Types_part_4.cc' was generated.
Notify: File `NS_Types_part_5.cc' was generated.
Notify: File `NS_Types_part_6.cc' was generated.
Notify: File `NS_Types_part_7.cc' was generated.
Notify: File `Native_Functions.hh' was generated.
Notify: File `Native_Functions.cc' was generated.
Notify: File `Native_Functions_part_1.cc' was generated.
Notify: File `Native_Functions_part_2.cc' was generated.
Notify: File `Native_Functions_part_3.cc' was generated.
Notify: File `Native_Functions_part_4.cc' was generated.
Notify: File `Native_Functions_part_5.cc' was generated.
Notify: File `Native_Functions_part_6.cc' was generated.
Notify: File `Native_Functions_part_7.cc' was generated.
Notify: File `Osmocom_CTRL_Adapter.hh' was generated.
Notify: File `Osmocom_CTRL_Adapter.cc' was generated.
Notify: File `Osmocom_CTRL_Adapter_part_1.cc' was generated.
Notify: File `Osmocom_CTRL_Adapter_part_2.cc' was generated.
Notify: File `Osmocom_CTRL_Adapter_part_3.cc' was generated.
Notify: File `Osmocom_CTRL_Adapter_part_4.cc' was generated.
Notify: File `Osmocom_CTRL_Adapter_part_5.cc' was generated.
Notify: File `Osmocom_CTRL_Adapter_part_6.cc' was generated.
Notify: File `Osmocom_CTRL_Adapter_part_7.cc' was generated.
Notify: File `Osmocom_CTRL_Functions.hh' was generated.
Notify: File `Osmocom_CTRL_Functions.cc' was generated.
Notify: File `Osmocom_CTRL_Functions_part_1.cc' was generated.
Notify: File `Osmocom_CTRL_Functions_part_2.cc' was generated.
Notify: File `Osmocom_CTRL_Functions_part_3.cc' was generated.
Notify: File `Osmocom_CTRL_Functions_part_4.cc' was generated.
Notify: File `Osmocom_CTRL_Functions_part_5.cc' was generated.
Notify: File `Osmocom_CTRL_Functions_part_6.cc' was generated.
Notify: File `Osmocom_CTRL_Functions_part_7.cc' was generated.
Notify: File `Osmocom_CTRL_Types.hh' was generated.
Notify: File `Osmocom_CTRL_Types.cc' was generated.
Notify: File `Osmocom_CTRL_Types_part_1.cc' was generated.
Notify: File `Osmocom_CTRL_Types_part_2.cc' was generated.
Notify: File `Osmocom_CTRL_Types_part_3.cc' was generated.
Notify: File `Osmocom_CTRL_Types_part_4.cc' was generated.
Notify: File `Osmocom_CTRL_Types_part_5.cc' was generated.
Notify: File `Osmocom_CTRL_Types_part_6.cc' was generated.
Notify: File `Osmocom_CTRL_Types_part_7.cc' was generated.
Notify: File `Osmocom_Gb_Types.hh' was generated.
Notify: File `Osmocom_Gb_Types.cc' was generated.
Notify: File `Osmocom_Gb_Types_part_1.cc' was generated.
Notify: File `Osmocom_Gb_Types_part_2.cc' was generated.
Notify: File `Osmocom_Gb_Types_part_3.cc' was generated.
Notify: File `Osmocom_Gb_Types_part_4.cc' was generated.
Notify: File `Osmocom_Gb_Types_part_5.cc' was generated.
Notify: File `Osmocom_Gb_Types_part_6.cc' was generated.
Notify: File `Osmocom_Gb_Types_part_7.cc' was generated.
Notify: File `Osmocom_Types.hh' was generated.
Notify: File `Osmocom_Types.cc' was generated.
Notify: File `Osmocom_Types_part_1.cc' was generated.
Notify: File `Osmocom_Types_part_2.cc' was generated.
Notify: File `Osmocom_Types_part_3.cc' was generated.
Notify: File `Osmocom_Types_part_4.cc' was generated.
Notify: File `Osmocom_Types_part_5.cc' was generated.
Notify: File `Osmocom_Types_part_6.cc' was generated.
Notify: File `Osmocom_Types_part_7.cc' was generated.
Notify: File `Osmocom_VTY_Functions.hh' was generated.
Notify: File `Osmocom_VTY_Functions.cc' was generated.
Notify: File `Osmocom_VTY_Functions_part_1.cc' was generated.
Notify: File `Osmocom_VTY_Functions_part_2.cc' was generated.
Notify: File `Osmocom_VTY_Functions_part_3.cc' was generated.
Notify: File `Osmocom_VTY_Functions_part_4.cc' was generated.
Notify: File `Osmocom_VTY_Functions_part_5.cc' was generated.
Notify: File `Osmocom_VTY_Functions_part_6.cc' was generated.
Notify: File `Osmocom_VTY_Functions_part_7.cc' was generated.
Notify: File `PCO_Types.hh' was generated.
Notify: File `PCO_Types.cc' was generated.
Notify: File `PCO_Types_part_1.cc' was generated.
Notify: File `PCO_Types_part_2.cc' was generated.
Notify: File `PCO_Types_part_3.cc' was generated.
Notify: File `PCO_Types_part_4.cc' was generated.
Notify: File `PCO_Types_part_5.cc' was generated.
Notify: File `PCO_Types_part_6.cc' was generated.
Notify: File `PCO_Types_part_7.cc' was generated.
Notify: File `RANAP_CodecPort.hh' was generated.
Notify: File `RANAP_CodecPort.cc' was generated.
Notify: File `RANAP_CodecPort_part_1.cc' was generated.
Notify: File `RANAP_CodecPort_part_2.cc' was generated.
Notify: File `RANAP_CodecPort_part_3.cc' was generated.
Notify: File `RANAP_CodecPort_part_4.cc' was generated.
Notify: File `RANAP_CodecPort_part_5.cc' was generated.
Notify: File `RANAP_CodecPort_part_6.cc' was generated.
Notify: File `RANAP_CodecPort_part_7.cc' was generated.
Notify: File `RANAP_CommonDataTypes.hh' was generated.
Notify: File `RANAP_CommonDataTypes.cc' was generated.
Notify: File `RANAP_CommonDataTypes_part_1.cc' was generated.
Notify: File `RANAP_CommonDataTypes_part_2.cc' was generated.
Notify: File `RANAP_CommonDataTypes_part_3.cc' was generated.
Notify: File `RANAP_CommonDataTypes_part_4.cc' was generated.
Notify: File `RANAP_CommonDataTypes_part_5.cc' was generated.
Notify: File `RANAP_CommonDataTypes_part_6.cc' was generated.
Notify: File `RANAP_CommonDataTypes_part_7.cc' was generated.
Notify: File `RANAP_Constants.hh' was generated.
Notify: File `RANAP_Constants.cc' was generated.
Notify: File `RANAP_Constants_part_1.cc' was generated.
Notify: File `RANAP_Constants_part_2.cc' was generated.
Notify: File `RANAP_Constants_part_3.cc' was generated.
Notify: File `RANAP_Constants_part_4.cc' was generated.
Notify: File `RANAP_Constants_part_5.cc' was generated.
Notify: File `RANAP_Constants_part_6.cc' was generated.
Notify: File `RANAP_Constants_part_7.cc' was generated.
Notify: File `RANAP_Containers.hh' was generated.
Notify: File `RANAP_Containers.cc' was generated.
Notify: File `RANAP_Containers_part_1.cc' was generated.
Notify: File `RANAP_Containers_part_2.cc' was generated.
Notify: File `RANAP_Containers_part_3.cc' was generated.
Notify: File `RANAP_Containers_part_4.cc' was generated.
Notify: File `RANAP_Containers_part_5.cc' was generated.
Notify: File `RANAP_Containers_part_6.cc' was generated.
Notify: File `RANAP_Containers_part_7.cc' was generated.
Notify: File `RANAP_IEs.hh' was generated.
Notify: File `RANAP_IEs.cc' was generated.
Notify: File `RANAP_IEs_part_1.cc' was generated.
Notify: File `RANAP_IEs_part_2.cc' was generated.
Notify: File `RANAP_IEs_part_3.cc' was generated.
Notify: File `RANAP_IEs_part_4.cc' was generated.
Notify: File `RANAP_IEs_part_5.cc' was generated.
Notify: File `RANAP_IEs_part_6.cc' was generated.
Notify: File `RANAP_IEs_part_7.cc' was generated.
Notify: File `RANAP_PDU_Contents.hh' was generated.
Notify: File `RANAP_PDU_Contents.cc' was generated.
Notify: File `RANAP_PDU_Contents_part_1.cc' was generated.
Notify: File `RANAP_PDU_Contents_part_2.cc' was generated.
Notify: File `RANAP_PDU_Contents_part_3.cc' was generated.
Notify: File `RANAP_PDU_Contents_part_4.cc' was generated.
Notify: File `RANAP_PDU_Contents_part_5.cc' was generated.
Notify: File `RANAP_PDU_Contents_part_6.cc' was generated.
Notify: File `RANAP_PDU_Contents_part_7.cc' was generated.
Notify: File `RANAP_PDU_Descriptions.hh' was generated.
Notify: File `RANAP_PDU_Descriptions.cc' was generated.
Notify: File `RANAP_PDU_Descriptions_part_1.cc' was generated.
Notify: File `RANAP_PDU_Descriptions_part_2.cc' was generated.
Notify: File `RANAP_PDU_Descriptions_part_3.cc' was generated.
Notify: File `RANAP_PDU_Descriptions_part_4.cc' was generated.
Notify: File `RANAP_PDU_Descriptions_part_5.cc' was generated.
Notify: File `RANAP_PDU_Descriptions_part_6.cc' was generated.
Notify: File `RANAP_PDU_Descriptions_part_7.cc' was generated.
Notify: File `RANAP_Templates.hh' was generated.
Notify: File `RANAP_Templates.cc' was generated.
Notify: File `RANAP_Templates_part_1.cc' was generated.
Notify: File `RANAP_Templates_part_2.cc' was generated.
Notify: File `RANAP_Templates_part_3.cc' was generated.
Notify: File `RANAP_Templates_part_4.cc' was generated.
Notify: File `RANAP_Templates_part_5.cc' was generated.
Notify: File `RANAP_Templates_part_6.cc' was generated.
Notify: File `RANAP_Templates_part_7.cc' was generated.
Notify: File `RANAP_Types.hh' was generated.
Notify: File `RANAP_Types.cc' was generated.
Notify: File `RANAP_Types_part_1.cc' was generated.
Notify: File `RANAP_Types_part_2.cc' was generated.
Notify: File `RANAP_Types_part_3.cc' was generated.
Notify: File `RANAP_Types_part_4.cc' was generated.
Notify: File `RANAP_Types_part_5.cc' was generated.
Notify: File `RANAP_Types_part_6.cc' was generated.
Notify: File `RANAP_Types_part_7.cc' was generated.
Notify: File `RAN_Adapter.hh' was generated.
Notify: File `RAN_Adapter.cc' was generated.
Notify: File `RAN_Adapter_part_1.cc' was generated.
Notify: File `RAN_Adapter_part_2.cc' was generated.
Notify: File `RAN_Adapter_part_3.cc' was generated.
Notify: File `RAN_Adapter_part_4.cc' was generated.
Notify: File `RAN_Adapter_part_5.cc' was generated.
Notify: File `RAN_Adapter_part_6.cc' was generated.
Notify: File `RAN_Adapter_part_7.cc' was generated.
Notify: File `RAN_Emulation.hh' was generated.
Notify: File `RAN_Emulation.cc' was generated.
Notify: File `RAN_Emulation_part_1.cc' was generated.
Notify: File `RAN_Emulation_part_2.cc' was generated.
Notify: File `RAN_Emulation_part_3.cc' was generated.
Notify: File `RAN_Emulation_part_4.cc' was generated.
Notify: File `RAN_Emulation_part_5.cc' was generated.
Notify: File `RAN_Emulation_part_6.cc' was generated.
Notify: File `RAN_Emulation_part_7.cc' was generated.
Notify: File `RAW_NS.hh' was generated.
Notify: File `RAW_NS.cc' was generated.
Notify: File `RAW_NS_part_1.cc' was generated.
Notify: File `RAW_NS_part_2.cc' was generated.
Notify: File `RAW_NS_part_3.cc' was generated.
Notify: File `RAW_NS_part_4.cc' was generated.
Notify: File `RAW_NS_part_5.cc' was generated.
Notify: File `RAW_NS_part_6.cc' was generated.
Notify: File `RAW_NS_part_7.cc' was generated.
Notify: File `SCCP_Emulation.hh' was generated.
Notify: File `SCCP_Emulation.cc' was generated.
Notify: File `SCCP_Emulation_part_1.cc' was generated.
Notify: File `SCCP_Emulation_part_2.cc' was generated.
Notify: File `SCCP_Emulation_part_3.cc' was generated.
Notify: File `SCCP_Emulation_part_4.cc' was generated.
Notify: File `SCCP_Emulation_part_5.cc' was generated.
Notify: File `SCCP_Emulation_part_6.cc' was generated.
Notify: File `SCCP_Emulation_part_7.cc' was generated.
Notify: File `SCCP_Mapping.hh' was generated.
Notify: File `SCCP_Mapping.cc' was generated.
Notify: File `SCCP_Mapping_part_1.cc' was generated.
Notify: File `SCCP_Mapping_part_2.cc' was generated.
Notify: File `SCCP_Mapping_part_3.cc' was generated.
Notify: File `SCCP_Mapping_part_4.cc' was generated.
Notify: File `SCCP_Mapping_part_5.cc' was generated.
Notify: File `SCCP_Mapping_part_6.cc' was generated.
Notify: File `SCCP_Mapping_part_7.cc' was generated.
Notify: File `SCCP_Templates.hh' was generated.
Notify: File `SCCP_Templates.cc' was generated.
Notify: File `SCCP_Templates_part_1.cc' was generated.
Notify: File `SCCP_Templates_part_2.cc' was generated.
Notify: File `SCCP_Templates_part_3.cc' was generated.
Notify: File `SCCP_Templates_part_4.cc' was generated.
Notify: File `SCCP_Templates_part_5.cc' was generated.
Notify: File `SCCP_Templates_part_6.cc' was generated.
Notify: File `SCCP_Templates_part_7.cc' was generated.
Notify: File `SCCP_Types.hh' was generated.
Notify: File `SCCP_Types.cc' was generated.
Notify: File `SCCP_Types_part_1.cc' was generated.
Notify: File `SCCP_Types_part_2.cc' was generated.
Notify: File `SCCP_Types_part_3.cc' was generated.
Notify: File `SCCP_Types_part_4.cc' was generated.
Notify: File `SCCP_Types_part_5.cc' was generated.
Notify: File `SCCP_Types_part_6.cc' was generated.
Notify: File `SCCP_Types_part_7.cc' was generated.
Notify: File `SCCPasp_Types.hh' was generated.
Notify: File `SCCPasp_Types.cc' was generated.
Notify: File `SCCPasp_Types_part_1.cc' was generated.
Notify: File `SCCPasp_Types_part_2.cc' was generated.
Notify: File `SCCPasp_Types_part_3.cc' was generated.
Notify: File `SCCPasp_Types_part_4.cc' was generated.
Notify: File `SCCPasp_Types_part_5.cc' was generated.
Notify: File `SCCPasp_Types_part_6.cc' was generated.
Notify: File `SCCPasp_Types_part_7.cc' was generated.
Notify: File `SCTPasp_PortType.hh' was generated.
Notify: File `SCTPasp_PortType.cc' was generated.
Notify: File `SCTPasp_PortType_part_1.cc' was generated.
Notify: File `SCTPasp_PortType_part_2.cc' was generated.
Notify: File `SCTPasp_PortType_part_3.cc' was generated.
Notify: File `SCTPasp_PortType_part_4.cc' was generated.
Notify: File `SCTPasp_PortType_part_5.cc' was generated.
Notify: File `SCTPasp_PortType_part_6.cc' was generated.
Notify: File `SCTPasp_PortType_part_7.cc' was generated.
Notify: File `SCTPasp_Types.hh' was generated.
Notify: File `SCTPasp_Types.cc' was generated.
Notify: File `SCTPasp_Types_part_1.cc' was generated.
Notify: File `SCTPasp_Types_part_2.cc' was generated.
Notify: File `SCTPasp_Types_part_3.cc' was generated.
Notify: File `SCTPasp_Types_part_4.cc' was generated.
Notify: File `SCTPasp_Types_part_5.cc' was generated.
Notify: File `SCTPasp_Types_part_6.cc' was generated.
Notify: File `SCTPasp_Types_part_7.cc' was generated.
Notify: File `SGSN_Tests.hh' was generated.
Notify: File `SGSN_Tests.cc' was generated.
Notify: File `SGSN_Tests_Iu.hh' was generated.
Notify: File `SGSN_Tests_Iu.cc' was generated.
Notify: File `SGSN_Tests_Iu_part_1.cc' was generated.
Notify: File `SGSN_Tests_Iu_part_2.cc' was generated.
Notify: File `SGSN_Tests_Iu_part_3.cc' was generated.
Notify: File `SGSN_Tests_Iu_part_4.cc' was generated.
Notify: File `SGSN_Tests_Iu_part_5.cc' was generated.
Notify: File `SGSN_Tests_Iu_part_6.cc' was generated.
Notify: File `SGSN_Tests_Iu_part_7.cc' was generated.
Notify: File `SGSN_Tests_NS.hh' was generated.
Notify: File `SGSN_Tests_NS.cc' was generated.
Notify: File `SGSN_Tests_NS_part_1.cc' was generated.
Notify: File `SGSN_Tests_NS_part_2.cc' was generated.
Notify: File `SGSN_Tests_NS_part_3.cc' was generated.
Notify: File `SGSN_Tests_NS_part_4.cc' was generated.
Notify: File `SGSN_Tests_NS_part_5.cc' was generated.
Notify: File `SGSN_Tests_NS_part_6.cc' was generated.
Notify: File `SGSN_Tests_NS_part_7.cc' was generated.
Notify: File `SGSN_Tests_part_1.cc' was generated.
Notify: File `SGSN_Tests_part_2.cc' was generated.
Notify: File `SGSN_Tests_part_3.cc' was generated.
Notify: File `SGSN_Tests_part_4.cc' was generated.
Notify: File `SGSN_Tests_part_5.cc' was generated.
Notify: File `SGSN_Tests_part_6.cc' was generated.
Notify: File `SGSN_Tests_part_7.cc' was generated.
Notify: File `SNDCP_Types.hh' was generated.
Notify: File `SNDCP_Types.cc' was generated.
Notify: File `SNDCP_Types_part_1.cc' was generated.
Notify: File `SNDCP_Types_part_2.cc' was generated.
Notify: File `SNDCP_Types_part_3.cc' was generated.
Notify: File `SNDCP_Types_part_4.cc' was generated.
Notify: File `SNDCP_Types_part_5.cc' was generated.
Notify: File `SNDCP_Types_part_6.cc' was generated.
Notify: File `SNDCP_Types_part_7.cc' was generated.
Notify: File `Socket_API_Definitions.hh' was generated.
Notify: File `Socket_API_Definitions.cc' was generated.
Notify: File `Socket_API_Definitions_part_1.cc' was generated.
Notify: File `Socket_API_Definitions_part_2.cc' was generated.
Notify: File `Socket_API_Definitions_part_3.cc' was generated.
Notify: File `Socket_API_Definitions_part_4.cc' was generated.
Notify: File `Socket_API_Definitions_part_5.cc' was generated.
Notify: File `Socket_API_Definitions_part_6.cc' was generated.
Notify: File `Socket_API_Definitions_part_7.cc' was generated.
Notify: File `TCCConversion_Functions.hh' was generated.
Notify: File `TCCConversion_Functions.cc' was generated.
Notify: File `TCCConversion_Functions_part_1.cc' was generated.
Notify: File `TCCConversion_Functions_part_2.cc' was generated.
Notify: File `TCCConversion_Functions_part_3.cc' was generated.
Notify: File `TCCConversion_Functions_part_4.cc' was generated.
Notify: File `TCCConversion_Functions_part_5.cc' was generated.
Notify: File `TCCConversion_Functions_part_6.cc' was generated.
Notify: File `TCCConversion_Functions_part_7.cc' was generated.
Notify: File `TCCInterface_Functions.hh' was generated.
Notify: File `TCCInterface_Functions.cc' was generated.
Notify: File `TCCInterface_Functions_part_1.cc' was generated.
Notify: File `TCCInterface_Functions_part_2.cc' was generated.
Notify: File `TCCInterface_Functions_part_3.cc' was generated.
Notify: File `TCCInterface_Functions_part_4.cc' was generated.
Notify: File `TCCInterface_Functions_part_5.cc' was generated.
Notify: File `TCCInterface_Functions_part_6.cc' was generated.
Notify: File `TCCInterface_Functions_part_7.cc' was generated.
Notify: File `TELNETasp_PortType.hh' was generated.
Notify: File `TELNETasp_PortType.cc' was generated.
Notify: File `TELNETasp_PortType_part_1.cc' was generated.
Notify: File `TELNETasp_PortType_part_2.cc' was generated.
Notify: File `TELNETasp_PortType_part_3.cc' was generated.
Notify: File `TELNETasp_PortType_part_4.cc' was generated.
Notify: File `TELNETasp_PortType_part_5.cc' was generated.
Notify: File `TELNETasp_PortType_part_6.cc' was generated.
Notify: File `TELNETasp_PortType_part_7.cc' was generated.
Notify: 711 files were updated.
touch compile
make[1]: Leaving directory '/build/sgsn'
(cd simtrace && ./gen_links.sh && ./regen_makefile.sh)
Linking TCCConversion_Functions.ttcn
Linking TCCConversion.cc
Linking USB_PT.cc
Linking USB_PT.hh
Linking USB_PortType.ttcn
Linking USB_PortTypes.ttcn
Linking USB_Templates.ttcn
Linking USB_Types.ttcn
Linking USB_Component.ttcn
Linking Misc_Helpers.ttcn
Linking General_Types.ttcn
Linking Osmocom_Types.ttcn
Linking Native_Functions.ttcn
Linking Native_FunctionDefs.cc
Linking SIMTRACE_Types.ttcn
Linking SIMTRACE_Templates.ttcn
Linking SIMTRACE_Emulation.ttcn
ttcn3_makefilegen: warning: TTCN-3 preprocessing (option `-p') is enabled, but no TTCN-3 files to be preprocessed were given for the Makefile.
Generating Makefile skeleton...
Makefile skeleton was generated.
make -C simtrace compile
make[1]: Entering directory '/build/simtrace'
/usr/bin/ttcn3_compiler -L -U 8 General_Types.ttcn Misc_Helpers.ttcn Native_Functions.ttcn Osmocom_Types.ttcn SIMTRACE_CARDEM_Tests.ttcn SIMTRACE_Emulation.ttcn SIMTRACE_Templates.ttcn SIMTRACE_Tests.ttcn SIMTRACE_Types.ttcn TCCConversion_Functions.ttcn USB_Component.ttcn USB_PortType.ttcn USB_PortTypes.ttcn USB_Templates.ttcn USB_Types.ttcn - General_Types.ttcn Misc_Helpers.ttcn Native_Functions.ttcn Osmocom_Types.ttcn SIMTRACE_CARDEM_Tests.ttcn SIMTRACE_Emulation.ttcn SIMTRACE_Templates.ttcn SIMTRACE_Tests.ttcn SIMTRACE_Types.ttcn TCCConversion_Functions.ttcn USB_Component.ttcn USB_PortType.ttcn USB_PortTypes.ttcn USB_Templates.ttcn USB_Types.ttcn
warning: Charstring pattern: Environment variable TTCN3_DIR not present. Case-insensitive universal charstring patterns are disabled.

Notify: Parsing TTCN-3 module `General_Types.ttcn'...
Notify: Parsing TTCN-3 module `Misc_Helpers.ttcn'...
Notify: Parsing TTCN-3 module `Native_Functions.ttcn'...
Notify: Parsing TTCN-3 module `Osmocom_Types.ttcn'...
Notify: Parsing TTCN-3 module `SIMTRACE_CARDEM_Tests.ttcn'...
Notify: Parsing TTCN-3 module `SIMTRACE_Emulation.ttcn'...
Notify: Parsing TTCN-3 module `SIMTRACE_Templates.ttcn'...
Notify: Parsing TTCN-3 module `SIMTRACE_Tests.ttcn'...
Notify: Parsing TTCN-3 module `SIMTRACE_Types.ttcn'...
Notify: Parsing TTCN-3 module `TCCConversion_Functions.ttcn'...
Notify: Parsing TTCN-3 module `USB_Component.ttcn'...
Notify: Parsing TTCN-3 module `USB_PortType.ttcn'...
Notify: Parsing TTCN-3 module `USB_PortTypes.ttcn'...
Notify: Parsing TTCN-3 module `USB_Templates.ttcn'...
Notify: Parsing TTCN-3 module `USB_Types.ttcn'...
Notify: Checking modules...
SIMTRACE_Tests.ttcn: In TTCN-3 module `SIMTRACE_Tests':
 SIMTRACE_Tests.ttcn:85.1-117.1: In testcase definition `TC_test':
  SIMTRACE_Tests.ttcn:92.2-93.50: In function instance:
   SIMTRACE_Tests.ttcn:92.2-93.50: warning: The value returned by function `@SIMTRACE_Tests.f_xceive' is not used
  SIMTRACE_Tests.ttcn:114.2-15: warning: Control never reaches this statement
Notify: Generating code...
Notify: File `General_Types.hh' was generated.
Notify: File `General_Types.cc' was generated.
Notify: File `General_Types_part_1.cc' was generated.
Notify: File `General_Types_part_2.cc' was generated.
Notify: File `General_Types_part_3.cc' was generated.
Notify: File `General_Types_part_4.cc' was generated.
Notify: File `General_Types_part_5.cc' was generated.
Notify: File `General_Types_part_6.cc' was generated.
Notify: File `General_Types_part_7.cc' was generated.
Notify: File `Misc_Helpers.hh' was generated.
Notify: File `Misc_Helpers.cc' was generated.
Notify: File `Misc_Helpers_part_1.cc' was generated.
Notify: File `Misc_Helpers_part_2.cc' was generated.
Notify: File `Misc_Helpers_part_3.cc' was generated.
Notify: File `Misc_Helpers_part_4.cc' was generated.
Notify: File `Misc_Helpers_part_5.cc' was generated.
Notify: File `Misc_Helpers_part_6.cc' was generated.
Notify: File `Misc_Helpers_part_7.cc' was generated.
Notify: File `Native_Functions.hh' was generated.
Notify: File `Native_Functions.cc' was generated.
Notify: File `Native_Functions_part_1.cc' was generated.
Notify: File `Native_Functions_part_2.cc' was generated.
Notify: File `Native_Functions_part_3.cc' was generated.
Notify: File `Native_Functions_part_4.cc' was generated.
Notify: File `Native_Functions_part_5.cc' was generated.
Notify: File `Native_Functions_part_6.cc' was generated.
Notify: File `Native_Functions_part_7.cc' was generated.
Notify: File `Osmocom_Types.hh' was generated.
Notify: File `Osmocom_Types.cc' was generated.
Notify: File `Osmocom_Types_part_1.cc' was generated.
Notify: File `Osmocom_Types_part_2.cc' was generated.
Notify: File `Osmocom_Types_part_3.cc' was generated.
Notify: File `Osmocom_Types_part_4.cc' was generated.
Notify: File `Osmocom_Types_part_5.cc' was generated.
Notify: File `Osmocom_Types_part_6.cc' was generated.
Notify: File `Osmocom_Types_part_7.cc' was generated.
Notify: File `SIMTRACE_CARDEM_Tests.hh' was generated.
Notify: File `SIMTRACE_CARDEM_Tests.cc' was generated.
Notify: File `SIMTRACE_CARDEM_Tests_part_1.cc' was generated.
Notify: File `SIMTRACE_CARDEM_Tests_part_2.cc' was generated.
Notify: File `SIMTRACE_CARDEM_Tests_part_3.cc' was generated.
Notify: File `SIMTRACE_CARDEM_Tests_part_4.cc' was generated.
Notify: File `SIMTRACE_CARDEM_Tests_part_5.cc' was generated.
Notify: File `SIMTRACE_CARDEM_Tests_part_6.cc' was generated.
Notify: File `SIMTRACE_CARDEM_Tests_part_7.cc' was generated.
Notify: File `SIMTRACE_Emulation.hh' was generated.
Notify: File `SIMTRACE_Emulation.cc' was generated.
Notify: File `SIMTRACE_Emulation_part_1.cc' was generated.
Notify: File `SIMTRACE_Emulation_part_2.cc' was generated.
Notify: File `SIMTRACE_Emulation_part_3.cc' was generated.
Notify: File `SIMTRACE_Emulation_part_4.cc' was generated.
Notify: File `SIMTRACE_Emulation_part_5.cc' was generated.
Notify: File `SIMTRACE_Emulation_part_6.cc' was generated.
Notify: File `SIMTRACE_Emulation_part_7.cc' was generated.
Notify: File `SIMTRACE_Templates.hh' was generated.
Notify: File `SIMTRACE_Templates.cc' was generated.
Notify: File `SIMTRACE_Templates_part_1.cc' was generated.
Notify: File `SIMTRACE_Templates_part_2.cc' was generated.
Notify: File `SIMTRACE_Templates_part_3.cc' was generated.
Notify: File `SIMTRACE_Templates_part_4.cc' was generated.
Notify: File `SIMTRACE_Templates_part_5.cc' was generated.
Notify: File `SIMTRACE_Templates_part_6.cc' was generated.
Notify: File `SIMTRACE_Templates_part_7.cc' was generated.
Notify: File `SIMTRACE_Tests.hh' was generated.
Notify: File `SIMTRACE_Tests.cc' was generated.
Notify: File `SIMTRACE_Tests_part_1.cc' was generated.
Notify: File `SIMTRACE_Tests_part_2.cc' was generated.
Notify: File `SIMTRACE_Tests_part_3.cc' was generated.
Notify: File `SIMTRACE_Tests_part_4.cc' was generated.
Notify: File `SIMTRACE_Tests_part_5.cc' was generated.
Notify: File `SIMTRACE_Tests_part_6.cc' was generated.
Notify: File `SIMTRACE_Tests_part_7.cc' was generated.
Notify: File `SIMTRACE_Types.hh' was generated.
Notify: File `SIMTRACE_Types.cc' was generated.
Notify: File `SIMTRACE_Types_part_1.cc' was generated.
Notify: File `SIMTRACE_Types_part_2.cc' was generated.
Notify: File `SIMTRACE_Types_part_3.cc' was generated.
Notify: File `SIMTRACE_Types_part_4.cc' was generated.
Notify: File `SIMTRACE_Types_part_5.cc' was generated.
Notify: File `SIMTRACE_Types_part_6.cc' was generated.
Notify: File `SIMTRACE_Types_part_7.cc' was generated.
Notify: File `TCCConversion_Functions.hh' was generated.
Notify: File `TCCConversion_Functions.cc' was generated.
Notify: File `TCCConversion_Functions_part_1.cc' was generated.
Notify: File `TCCConversion_Functions_part_2.cc' was generated.
Notify: File `TCCConversion_Functions_part_3.cc' was generated.
Notify: File `TCCConversion_Functions_part_4.cc' was generated.
Notify: File `TCCConversion_Functions_part_5.cc' was generated.
Notify: File `TCCConversion_Functions_part_6.cc' was generated.
Notify: File `TCCConversion_Functions_part_7.cc' was generated.
Notify: File `USB_Component.hh' was generated.
Notify: File `USB_Component.cc' was generated.
Notify: File `USB_Component_part_1.cc' was generated.
Notify: File `USB_Component_part_2.cc' was generated.
Notify: File `USB_Component_part_3.cc' was generated.
Notify: File `USB_Component_part_4.cc' was generated.
Notify: File `USB_Component_part_5.cc' was generated.
Notify: File `USB_Component_part_6.cc' was generated.
Notify: File `USB_Component_part_7.cc' was generated.
Notify: File `USB_PortType.hh' was generated.
Notify: File `USB_PortType.cc' was generated.
Notify: File `USB_PortType_part_1.cc' was generated.
Notify: File `USB_PortType_part_2.cc' was generated.
Notify: File `USB_PortType_part_3.cc' was generated.
Notify: File `USB_PortType_part_4.cc' was generated.
Notify: File `USB_PortType_part_5.cc' was generated.
Notify: File `USB_PortType_part_6.cc' was generated.
Notify: File `USB_PortType_part_7.cc' was generated.
Notify: File `USB_PortTypes.hh' was generated.
Notify: File `USB_PortTypes.cc' was generated.
Notify: File `USB_PortTypes_part_1.cc' was generated.
Notify: File `USB_PortTypes_part_2.cc' was generated.
Notify: File `USB_PortTypes_part_3.cc' was generated.
Notify: File `USB_PortTypes_part_4.cc' was generated.
Notify: File `USB_PortTypes_part_5.cc' was generated.
Notify: File `USB_PortTypes_part_6.cc' was generated.
Notify: File `USB_PortTypes_part_7.cc' was generated.
Notify: File `USB_Templates.hh' was generated.
Notify: File `USB_Templates.cc' was generated.
Notify: File `USB_Templates_part_1.cc' was generated.
Notify: File `USB_Templates_part_2.cc' was generated.
Notify: File `USB_Templates_part_3.cc' was generated.
Notify: File `USB_Templates_part_4.cc' was generated.
Notify: File `USB_Templates_part_5.cc' was generated.
Notify: File `USB_Templates_part_6.cc' was generated.
Notify: File `USB_Templates_part_7.cc' was generated.
Notify: File `USB_Types.hh' was generated.
Notify: File `USB_Types.cc' was generated.
Notify: File `USB_Types_part_1.cc' was generated.
Notify: File `USB_Types_part_2.cc' was generated.
Notify: File `USB_Types_part_3.cc' was generated.
Notify: File `USB_Types_part_4.cc' was generated.
Notify: File `USB_Types_part_5.cc' was generated.
Notify: File `USB_Types_part_6.cc' was generated.
Notify: File `USB_Types_part_7.cc' was generated.
Notify: 135 files were updated.
touch compile
make[1]: Leaving directory '/build/simtrace'
(cd sip && ./gen_links.sh && ./regen_makefile.sh)
Linking UD_PT.cc
Linking UD_PT.hh
Linking UD_PortType.ttcn
Linking UD_Types.ttcn
Linking TCCInterface_Functions.ttcn
Linking TCCConversion_Functions.ttcn
Linking TCCConversion.cc
Linking TCCInterface.cc
Linking TCCInterface_ip.h
Linking TCCOpenSecurity_Functions.ttcn
Linking TCCOpenSecurity.cc
Linking TCCOpenSecurity_Functions.hh
Linking TCCDateTime.cc
Linking TCCDateTime_Functions.ttcn
Linking Socket_API_Definitions.ttcn
Linking IPL4asp_Functions.ttcn
Linking IPL4asp_PT.cc
Linking IPL4asp_PT.hh
Linking IPL4asp_PortType.ttcn
Linking IPL4asp_Types.ttcn
Linking IPL4asp_discovery.cc
Linking IPL4asp_protocol_L234.hh
Linking SDP_EncDec.cc
Linking SDP_Types.ttcn
Linking SDP_parse_.tab.c
Linking SDP_parse_.tab.h
Linking SDP_parse_parser.h
Linking SDP_parser.l
Linking SDP_parser.y
Linking lex.SDP_parse_.c
Linking RTP_EncDec.cc
Linking RTP_Types.ttcn
Linking SIP_parse.h
Linking SIP_parse.y
Linking SIP_parse_.tab.h
Linking SIPmsg_PT.hh
Linking SIPmsg_Types.ttcn
Linking SIP_parse.l
Linking SIP_parse_.tab.c
Linking SIPmsg_PT.cc
Linking SIPmsg_PortType.ttcn
Linking lex.SIP_parse_.c
Linking TELNETasp_PT.cc
Linking TELNETasp_PT.hh
Linking TELNETasp_PortType.ttcn
Linking Misc_Helpers.ttcn
Linking General_Types.ttcn
Linking GSM_Types.ttcn
Linking Osmocom_Types.ttcn
Linking MNCC_Types.ttcn
Linking MNCC_EncDec.cc
Linking MNCC_CodecPort.ttcn
Linking mncc.h
Linking MNCC_Emulation.ttcn
Linking Osmocom_VTY_Functions.ttcn
Linking Native_Functions.ttcn
Linking Native_FunctionDefs.cc
Linking IPA_Types.ttcn
Linking IPA_Emulation.ttcnpp
Linking IPA_CodecPort.ttcn
Linking IPA_CodecPort_CtrlFunct.ttcn
Linking IPA_CodecPort_CtrlFunctDef.cc
Linking Osmocom_CTRL_Types.ttcn
Linking Osmocom_CTRL_Functions.ttcn
Linking Osmocom_CTRL_Adapter.ttcn
Linking RTP_CodecPort.ttcn
Linking RTP_CodecPort_CtrlFunctDef.cc
Linking SDP_Templates.ttcn
Linking SIP_Emulation.ttcn
Linking SIP_Templates.ttcn
Generating Makefile skeleton...
Makefile skeleton was generated.
make -C sip compile
make[1]: Entering directory '/build/sip'
cpp -x c -nostdinc -DIPA_EMULATION_CTRL -DRAN_EMULATION_CTRL IPA_Emulation.ttcnpp IPA_Emulation.ttcn
/usr/bin/ttcn3_compiler -L -U 8 GSM_Types.ttcn General_Types.ttcn IPA_CodecPort.ttcn IPA_CodecPort_CtrlFunct.ttcn IPA_Types.ttcn IPL4asp_Functions.ttcn IPL4asp_PortType.ttcn IPL4asp_Types.ttcn MNCC_CodecPort.ttcn MNCC_Emulation.ttcn MNCC_Types.ttcn Misc_Helpers.ttcn Native_Functions.ttcn Osmocom_CTRL_Adapter.ttcn Osmocom_CTRL_Functions.ttcn Osmocom_CTRL_Types.ttcn Osmocom_Types.ttcn Osmocom_VTY_Functions.ttcn RTP_CodecPort.ttcn RTP_Types.ttcn SDP_Templates.ttcn SDP_Types.ttcn SIP_Emulation.ttcn SIP_Templates.ttcn SIP_Tests.ttcn SIPmsg_PortType.ttcn SIPmsg_Types.ttcn Socket_API_Definitions.ttcn TCCConversion_Functions.ttcn TCCDateTime_Functions.ttcn TCCInterface_Functions.ttcn TCCOpenSecurity_Functions.ttcn TELNETasp_PortType.ttcn UD_PortType.ttcn UD_Types.ttcn IPA_Emulation.ttcn - GSM_Types.ttcn General_Types.ttcn IPA_CodecPort.ttcn IPA_CodecPort_CtrlFunct.ttcn IPA_Types.ttcn IPL4asp_Functions.ttcn IPL4asp_PortType.ttcn IPL4asp_Types.ttcn MNCC_CodecPort.ttcn MNCC_Emulation.ttcn MNCC_Types.ttcn Misc_Helpers.ttcn Native_Functions.ttcn Osmocom_CTRL_Adapter.ttcn Osmocom_CTRL_Functions.ttcn Osmocom_CTRL_Types.ttcn Osmocom_Types.ttcn Osmocom_VTY_Functions.ttcn RTP_CodecPort.ttcn RTP_Types.ttcn SDP_Templates.ttcn SDP_Types.ttcn SIP_Emulation.ttcn SIP_Templates.ttcn SIP_Tests.ttcn SIPmsg_PortType.ttcn SIPmsg_Types.ttcn Socket_API_Definitions.ttcn TCCConversion_Functions.ttcn TCCDateTime_Functions.ttcn TCCInterface_Functions.ttcn TCCOpenSecurity_Functions.ttcn TELNETasp_PortType.ttcn UD_PortType.ttcn UD_Types.ttcn IPA_Emulation.ttcn
warning: Charstring pattern: Environment variable TTCN3_DIR not present. Case-insensitive universal charstring patterns are disabled.

Notify: Parsing TTCN-3 module `GSM_Types.ttcn'...
Notify: Parsing TTCN-3 module `General_Types.ttcn'...
Notify: Parsing TTCN-3 module `IPA_CodecPort.ttcn'...
Notify: Parsing TTCN-3 module `IPA_CodecPort_CtrlFunct.ttcn'...
Notify: Parsing TTCN-3 module `IPA_Types.ttcn'...
Notify: Parsing TTCN-3 module `IPL4asp_Functions.ttcn'...
Notify: Parsing TTCN-3 module `IPL4asp_PortType.ttcn'...
Notify: Parsing TTCN-3 module `IPL4asp_Types.ttcn'...
Notify: Parsing TTCN-3 module `MNCC_CodecPort.ttcn'...
Notify: Parsing TTCN-3 module `MNCC_Emulation.ttcn'...
Notify: Parsing TTCN-3 module `MNCC_Types.ttcn'...
Notify: Parsing TTCN-3 module `Misc_Helpers.ttcn'...
Notify: Parsing TTCN-3 module `Native_Functions.ttcn'...
Notify: Parsing TTCN-3 module `Osmocom_CTRL_Adapter.ttcn'...
Notify: Parsing TTCN-3 module `Osmocom_CTRL_Functions.ttcn'...
Notify: Parsing TTCN-3 module `Osmocom_CTRL_Types.ttcn'...
Osmocom_CTRL_Types.ttcn:26.39-88: In character string pattern:
 Osmocom_CTRL_Types.ttcn:26.44-45: warning: Use of unrecognized escape sequence `\{' is deprecated
 Osmocom_CTRL_Types.ttcn:26.46-47: warning: Use of unrecognized escape sequence `\}' is deprecated
Notify: Parsing TTCN-3 module `Osmocom_Types.ttcn'...
Notify: Parsing TTCN-3 module `Osmocom_VTY_Functions.ttcn'...
Notify: Parsing TTCN-3 module `RTP_CodecPort.ttcn'...
Notify: Parsing TTCN-3 module `RTP_Types.ttcn'...
Notify: Parsing TTCN-3 module `SDP_Templates.ttcn'...
Notify: Parsing TTCN-3 module `SDP_Types.ttcn'...
Notify: Parsing TTCN-3 module `SIP_Emulation.ttcn'...
Notify: Parsing TTCN-3 module `SIP_Templates.ttcn'...
Notify: Parsing TTCN-3 module `SIP_Tests.ttcn'...
Notify: Parsing TTCN-3 module `SIPmsg_PortType.ttcn'...
Notify: Parsing TTCN-3 module `SIPmsg_Types.ttcn'...
SIPmsg_Types.ttcn:169.34: warning: Keyword 'timestamp' is treated as an identifier. Activate compiler option '-I' to use real-time testing features.
SIPmsg_Types.ttcn:288.24: warning: Keyword 'timestamp' is treated as an identifier. Activate compiler option '-I' to use real-time testing features.
SIPmsg_Types.ttcn:1840.9-17: warning: Keyword 'timestamp' is treated as an identifier. Activate compiler option '-I' to use real-time testing features.
Notify: Parsing TTCN-3 module `Socket_API_Definitions.ttcn'...
Notify: Parsing TTCN-3 module `TCCConversion_Functions.ttcn'...
Notify: Parsing TTCN-3 module `TCCDateTime_Functions.ttcn'...
Notify: Parsing TTCN-3 module `TCCInterface_Functions.ttcn'...
Notify: Parsing TTCN-3 module `TCCOpenSecurity_Functions.ttcn'...
Notify: Parsing TTCN-3 module `TELNETasp_PortType.ttcn'...
Notify: Parsing TTCN-3 module `UD_PortType.ttcn'...
Notify: Parsing TTCN-3 module `UD_Types.ttcn'...
Notify: Parsing TTCN-3 module `IPA_Emulation.ttcn'...
Notify: Checking modules...
MNCC_Emulation.ttcn: In TTCN-3 module `MNCC_Emulation':
 MNCC_Emulation.ttcn:400.1-431.1: In function definition `ExpectedCreateCallback':
  MNCC_Emulation.ttcn:406.2-411.2: In if statement:
   MNCC_Emulation.ttcn:410.3-12: warning: Control never reaches this statement
  MNCC_Emulation.ttcn:430.2-11: warning: Control never reaches this statement
SIP_Emulation.ttcn: In TTCN-3 module `SIP_Emulation':
 SIP_Emulation.ttcn:229.1-237.1: In function definition `f_init_sip':
  SIP_Emulation.ttcn:230.13-232.2: In variable definition `ops':
   SIP_Emulation.ttcn:231.3-59: In value for record field `create_cb':
    SIP_Emulation.ttcn:365.1-414.1: In function definition `ExpectedCreateCallback':
     SIP_Emulation.ttcn:371.2-376.2: In if statement:
      SIP_Emulation.ttcn:375.3-12: warning: Control never reaches this statement
     SIP_Emulation.ttcn:413.2-11: warning: Control never reaches this statement
SIP_Templates.ttcn: In TTCN-3 module `SIP_Templates':
 SIP_Templates.ttcn:86.1-114.1: In template definition `ts_Credentials_DigestResponseMD5':
  SIP_Templates.ttcn:98.20-113.2: In template for union field `digestResponse':
   SIP_Templates.ttcn:111.3-52: In component 9:
    SIP_Templates.ttcn:111.18-52: In actual parameter list of function `@SIP_Templates.f_ts_Param_omit':
     SIP_Templates.ttcn:111.29-51: In parameter #2 for `paramValue':
      SIP_Templates.ttcn:111.44-51: In actual parameter list of function `@SIP_Templates.f_sip_str_quote':
       SIP_Templates.ttcn:111.45-50: In parameter #1 for `val':
        SIP_Templates.ttcn:111.45-50: warning: Inadequate restriction on the referenced template parameter `cnonce', this may cause a dynamic test case error at runtime
        SIP_Templates.ttcn:95.4-44: note: Referenced template parameter is here
 SIP_Templates.ttcn:190.9-198.1: In function definition `f_tr_Contact_SipAddr':
  SIP_Templates.ttcn:197.2-40: In return statement:
   SIP_Templates.ttcn:197.27-40: In actual parameter list of template `@SIP_Templates.tr_Contact_SipAddr':
    SIP_Templates.ttcn:197.28-39: In parameter #1 for `contact_addr':
     SIP_Templates.ttcn:197.28-39: warning: Inadequate restriction on the referenced template parameter `contact_addr', this may cause a dynamic test case error at runtime
     SIP_Templates.ttcn:190.39-67: note: Referenced template parameter is here
 SIP_Templates.ttcn:202.9-208.1: In function definition `ts_Contact_SipAddr_omit':
  SIP_Templates.ttcn:207.2-40: In return statement:
   SIP_Templates.ttcn:207.27-40: In actual parameter list of template `@SIP_Templates.ts_Contact_SipAddr':
    SIP_Templates.ttcn:207.28-39: In parameter #1 for `contact_addr':
     SIP_Templates.ttcn:207.28-39: warning: Inadequate restriction on the referenced template parameter `contact_addr', this may cause a dynamic test case error at runtime
     SIP_Templates.ttcn:202.42-85: note: Referenced template parameter is here
 SIP_Templates.ttcn:309.1-325.1: In function definition `tr_SipAddr_from_val':
  SIP_Templates.ttcn:314.4-317.2: In if statement:
   SIP_Templates.ttcn:314.26-75: In actual parameter list of external function `@Native_Functions.f_str_tolower':
    SIP_Templates.ttcn:314.27-74: In parameter #1 for `input':
     SIP_Templates.ttcn:314.44-74: In actual parameter list of function `@SIP_Templates.f_sip_str_unquote':
      SIP_Templates.ttcn:314.45-73: In parameter #1 for `val':
       SIP_Templates.ttcn:314.45-73: warning: Inadequate restriction on the referenced template parameter `tin.addr.nameAddr.displayName', this may cause a dynamic test case error at runtime
       SIP_Templates.ttcn:309.30-57: note: Referenced template parameter is here
 SIP_Templates.ttcn:744.1-757.1: In template definition `tr_SIP_INVITE':
  SIP_Templates.ttcn:753.15-754.31: In template for record field `msgHeader':
   SIP_Templates.ttcn:753.30-754.31: In actual parameter list of template `@SIP_Templates.tr_SIP_msgh_std':
    SIP_Templates.ttcn:754.10-12: In parameter #5 for `via':
     SIP_Templates.ttcn:754.10-12: warning: Inadequate restriction on the referenced template parameter `via', this may cause a dynamic test case error at runtime
     SIP_Templates.ttcn:749.8-68: note: Referenced template parameter is here
 SIP_Templates.ttcn:775.1-788.1: In template definition `tr_SIP_BYE':
  SIP_Templates.ttcn:784.15-785.28: In template for record field `msgHeader':
   SIP_Templates.ttcn:784.30-785.28: In actual parameter list of template `@SIP_Templates.tr_SIP_msgh_std':
    SIP_Templates.ttcn:785.10-12: In parameter #5 for `via':
     SIP_Templates.ttcn:785.10-12: warning: Inadequate restriction on the referenced template parameter `via', this may cause a dynamic test case error at runtime
     SIP_Templates.ttcn:780.5-20: note: Referenced template parameter is here
 SIP_Templates.ttcn:808.1-822.1: In template definition `tr_SIP_ACK':
  SIP_Templates.ttcn:817.15-819.23: In template for record field `msgHeader':
   SIP_Templates.ttcn:817.30-819.23: In actual parameter list of template `@SIP_Templates.tr_SIP_msgh_std':
    SIP_Templates.ttcn:818.10-12: In parameter #5 for `via':
     SIP_Templates.ttcn:818.10-12: warning: Inadequate restriction on the referenced template parameter `via', this may cause a dynamic test case error at runtime
     SIP_Templates.ttcn:813.5-20: note: Referenced template parameter is here
SIP_Tests.ttcn: In TTCN-3 module `SIP_Tests':
 SIP_Tests.ttcn:233.1-369.1: In function definition `f_establish_mt':
  SIP_Tests.ttcn:279.2-282.39: In altstep instance:
   SIP_Tests.ttcn:279.20-282.39: In actual parameter list of altstep `@SIP_Tests.as_SIP_expect_resp':
    SIP_Tests.ttcn:279.21-282.38: In parameter #1 for `sip_expect':
     SIP_Tests.ttcn:279.36-282.38: In actual parameter list of template `@SIP_Templates.tr_SIP_Response':
      SIP_Tests.ttcn:280.9-92: In parameter #4 for `via':
       SIP_Tests.ttcn:280.20-92: In actual parameter list of template `@SIP_Templates.tr_Via_from':
        SIP_Tests.ttcn:280.21-91: In parameter #1 for `host_port':
         SIP_Tests.ttcn:280.46-91: In actual parameter list of function `@SIP_Templates.f_tr_HostPort_opt_defport':
          SIP_Tests.ttcn:280.47-90: In parameter #1 for `hp':
           SIP_Tests.ttcn:280.47-90: warning: Inadequate restriction on the referenced template variable `sip_addr_ext.addr.nameAddr.addrSpec.hostPort', this may cause a dynamic test case error at runtime
           SIP_Tests.ttcn:235.23-78: note: Referenced template variable is here
  SIP_Tests.ttcn:337.2-340.43: In altstep instance:
   SIP_Tests.ttcn:337.20-340.43: In actual parameter list of altstep `@SIP_Tests.as_SIP_expect_resp':
    SIP_Tests.ttcn:337.21-340.42: In parameter #1 for `sip_expect':
     SIP_Tests.ttcn:337.36-340.42: In actual parameter list of template `@SIP_Templates.tr_SIP_Response':
      SIP_Tests.ttcn:338.9-92: In parameter #4 for `via':
       SIP_Tests.ttcn:338.20-92: In actual parameter list of template `@SIP_Templates.tr_Via_from':
        SIP_Tests.ttcn:338.21-91: In parameter #1 for `host_port':
         SIP_Tests.ttcn:338.46-91: In actual parameter list of function `@SIP_Templates.f_tr_HostPort_opt_defport':
          SIP_Tests.ttcn:338.47-90: In parameter #1 for `hp':
           SIP_Tests.ttcn:338.47-90: warning: Inadequate restriction on the referenced template variable `sip_addr_ext.addr.nameAddr.addrSpec.hostPort', this may cause a dynamic test case error at runtime
           SIP_Tests.ttcn:235.23-78: note: Referenced template variable is here
  SIP_Tests.ttcn:347.2-348.15: In receive statement:
   SIP_Tests.ttcn:347.52-82: warning: Function invocation 'f_addrstr2addr(cp.sip_rtp_addr)' may change the actual snapshot.
  SIP_Tests.ttcn:353.2-358.35: In altstep instance:
   SIP_Tests.ttcn:353.20-358.35: In actual parameter list of altstep `@SIP_Tests.as_SIP_expect_resp':
    SIP_Tests.ttcn:353.21-358.34: In parameter #1 for `sip_expect':
     SIP_Tests.ttcn:353.36-358.34: In actual parameter list of template `@SIP_Templates.tr_SIP_Response':
      SIP_Tests.ttcn:354.9-92: In parameter #4 for `via':
       SIP_Tests.ttcn:354.20-92: In actual parameter list of template `@SIP_Templates.tr_Via_from':
        SIP_Tests.ttcn:354.21-91: In parameter #1 for `host_port':
         SIP_Tests.ttcn:354.46-91: In actual parameter list of function `@SIP_Templates.f_tr_HostPort_opt_defport':
          SIP_Tests.ttcn:354.47-90: In parameter #1 for `hp':
           SIP_Tests.ttcn:354.47-90: warning: Inadequate restriction on the referenced template variable `sip_addr_ext.addr.nameAddr.addrSpec.hostPort', this may cause a dynamic test case error at runtime
           SIP_Tests.ttcn:235.23-78: note: Referenced template variable is here
 SIP_Tests.ttcn:372.1-492.1: In function definition `f_establish_mo':
  SIP_Tests.ttcn:439.2-442.30: In variable assignment:
   SIP_Tests.ttcn:439.29-442.30: In actual parameter list of function `@SIP_Tests.f_SIP_expect_req':
    SIP_Tests.ttcn:439.30-442.29: In parameter #1 for `sip_expect':
     SIP_Tests.ttcn:439.43-442.29: In actual parameter list of template `@SIP_Templates.tr_SIP_INVITE':
      SIP_Tests.ttcn:439.44-78: In parameter #1 for `uri':
       SIP_Tests.ttcn:439.44-78: warning: Inadequate restriction on the referenced template variable `sip_addr_ext.addr.nameAddr.addrSpec', this may cause a dynamic test case error at runtime
       SIP_Tests.ttcn:376.23-78: note: Referenced template variable is here
      SIP_Tests.ttcn:441.9-92: In parameter #5 for `via':
       SIP_Tests.ttcn:441.20-92: In actual parameter list of template `@SIP_Templates.tr_Via_from':
        SIP_Tests.ttcn:441.21-91: In parameter #1 for `host_port':
         SIP_Tests.ttcn:441.46-91: In actual parameter list of function `@SIP_Templates.f_tr_HostPort_opt_defport':
          SIP_Tests.ttcn:441.47-90: In parameter #1 for `hp':
           SIP_Tests.ttcn:441.47-90: warning: Inadequate restriction on the referenced template variable `sip_addr_gsm.addr.nameAddr.addrSpec.hostPort', this may cause a dynamic test case error at runtime
           SIP_Tests.ttcn:375.23-78: note: Referenced template variable is here
  SIP_Tests.ttcn:465.2-467.23: In send statement:
   SIP_Tests.ttcn:465.26-467.22: In actual parameter list of template `@SIP_Templates.ts_SIP_Response':
    SIP_Tests.ttcn:467.6-21: In parameter #9 for `allow':
     SIP_Tests.ttcn:467.6-21: error: Type mismatch: a value or template of type `@SIPmsg_Types.Allow' was expected instead of `charstring'
  SIP_Tests.ttcn:486.2-491.19: In receive statement:
   SIP_Tests.ttcn:486.24-491.18: In actual parameter list of template `@SIP_Templates.tr_SIP_ACK':
    SIP_Tests.ttcn:486.25-59: In parameter #1 for `uri':
     SIP_Tests.ttcn:486.25-59: warning: Inadequate restriction on the referenced template variable `sip_addr_ext.addr.nameAddr.addrSpec', this may cause a dynamic test case error at runtime
     SIP_Tests.ttcn:376.23-78: note: Referenced template variable is here
    SIP_Tests.ttcn:490.11-94: In parameter #5 for `via':
     SIP_Tests.ttcn:490.22-94: In actual parameter list of template `@SIP_Templates.tr_Via_from':
      SIP_Tests.ttcn:490.23-93: In parameter #1 for `host_port':
       SIP_Tests.ttcn:490.48-93: In actual parameter list of function `@SIP_Templates.f_tr_HostPort_opt_defport':
        SIP_Tests.ttcn:490.49-92: In parameter #1 for `hp':
         SIP_Tests.ttcn:490.49-92: warning: Inadequate restriction on the referenced template variable `sip_addr_gsm.addr.nameAddr.addrSpec.hostPort', this may cause a dynamic test case error at runtime
         SIP_Tests.ttcn:375.23-78: note: Referenced template variable is here
   SIP_Tests.ttcn:490.23-93: warning: Function invocation 'f_tr_HostPort_opt_defport(sip_addr_gsm.addr.nameAddr.addrSpec.hostPort)' may change the actual snapshot.
 SIP_Tests.ttcn:495.1-518.1: In function definition `f_release_mobile':
  SIP_Tests.ttcn:504.2-507.18: In variable assignment:
   SIP_Tests.ttcn:504.29-507.18: In actual parameter list of function `@SIP_Tests.f_SIP_expect_req':
    SIP_Tests.ttcn:504.30-507.17: In parameter #1 for `sip_expect':
     SIP_Tests.ttcn:504.40-507.17: In actual parameter list of template `@SIP_Templates.tr_SIP_BYE':
      SIP_Tests.ttcn:504.41-75: In parameter #1 for `uri':
       SIP_Tests.ttcn:504.41-75: warning: Inadequate restriction on the referenced template variable `sip_addr_ext.addr.nameAddr.addrSpec', this may cause a dynamic test case error at runtime
       SIP_Tests.ttcn:497.23-78: note: Referenced template variable is here
      SIP_Tests.ttcn:506.13-96: In parameter #5 for `via':
       SIP_Tests.ttcn:506.24-96: In actual parameter list of template `@SIP_Templates.tr_Via_from':
        SIP_Tests.ttcn:506.25-95: In parameter #1 for `host_port':
         SIP_Tests.ttcn:506.50-95: In actual parameter list of function `@SIP_Templates.f_tr_HostPort_opt_defport':
          SIP_Tests.ttcn:506.51-94: In parameter #1 for `hp':
           SIP_Tests.ttcn:506.51-94: warning: Inadequate restriction on the referenced template variable `sip_addr_gsm.addr.nameAddr.addrSpec.hostPort', this may cause a dynamic test case error at runtime
           SIP_Tests.ttcn:496.23-78: note: Referenced template variable is here
 SIP_Tests.ttcn:521.1-537.1: In function definition `f_release_sip':
  SIP_Tests.ttcn:533.2-536.52: In altstep instance:
   SIP_Tests.ttcn:533.20-536.52: In actual parameter list of altstep `@SIP_Tests.as_SIP_expect_resp':
    SIP_Tests.ttcn:533.21-536.51: In parameter #1 for `sip_expect':
     SIP_Tests.ttcn:533.36-536.51: In actual parameter list of template `@SIP_Templates.tr_SIP_Response':
      SIP_Tests.ttcn:534.9-92: In parameter #4 for `via':
       SIP_Tests.ttcn:534.20-92: In actual parameter list of template `@SIP_Templates.tr_Via_from':
        SIP_Tests.ttcn:534.21-91: In parameter #1 for `host_port':
         SIP_Tests.ttcn:534.46-91: In actual parameter list of function `@SIP_Templates.f_tr_HostPort_opt_defport':
          SIP_Tests.ttcn:534.47-90: In parameter #1 for `hp':
           SIP_Tests.ttcn:534.47-90: warning: Inadequate restriction on the referenced template variable `sip_addr_ext.addr.nameAddr.addrSpec.hostPort', this may cause a dynamic test case error at runtime
           SIP_Tests.ttcn:523.23-78: note: Referenced template variable is here
 SIP_Tests.ttcn:667.9-713.1: In function definition `f_TC_mo_setup_disc_late_rtp':
  SIP_Tests.ttcn:702.2-712.2: In alt construct:
   SIP_Tests.ttcn:703.5-706.15: In guard operation:
    SIP_Tests.ttcn:703.5-706.15: In receive statement:
     SIP_Tests.ttcn:703.30-706.14: In actual parameter list of template `@SIP_Templates.tr_SIP_INVITE':
      SIP_Tests.ttcn:703.31-65: In parameter #1 for `uri':
       SIP_Tests.ttcn:703.31-65: warning: Inadequate restriction on the referenced template variable `sip_addr_ext.addr.nameAddr.addrSpec', this may cause a dynamic test case error at runtime
       SIP_Tests.ttcn:679.23-78: note: Referenced template variable is here
      SIP_Tests.ttcn:705.10-93: In parameter #5 for `via':
       SIP_Tests.ttcn:705.21-93: In actual parameter list of template `@SIP_Templates.tr_Via_from':
        SIP_Tests.ttcn:705.22-92: In parameter #1 for `host_port':
         SIP_Tests.ttcn:705.47-92: In actual parameter list of function `@SIP_Templates.f_tr_HostPort_opt_defport':
          SIP_Tests.ttcn:705.48-91: In parameter #1 for `hp':
           SIP_Tests.ttcn:705.48-91: warning: Inadequate restriction on the referenced template variable `sip_addr_gsm.addr.nameAddr.addrSpec.hostPort', this may cause a dynamic test case error at runtime
           SIP_Tests.ttcn:678.23-78: note: Referenced template variable is here
     SIP_Tests.ttcn:705.22-92: warning: Function invocation 'f_tr_HostPort_opt_defport(sip_addr_gsm.addr.nameAddr.addrSpec.hostPort)' may change the actual snapshot.
Notify: Error found in the input modules. Code will not be generated.
make[1]: *** [Makefile:206: compile] Error 1
make[1]: Leaving directory '/build/sip'
make: *** [Makefile:114: sip/compile] Error 2
Build step 'Execute shell' marked build as failure
Finished: FAILURE